program: Gaussian 09
title: 000288959
version: EM64L-G09RevD.01
frameworkgroup: C1[X(C19H17ClO)]
method: RPBEPBE
basis: SDD
operation: Freq
keyword: #p
keyword: freq=noraman
keyword: PBEPBE/SDD
title: #p freq=noraman PBEPBE/SDD
converged: YES YES NO NO
title: Mulliken charges:
elementType: Cl O C C C C C C C C C C C C C C C C C C C H H H H H H H H H H H H H H H H H
charge: -0.081589 -0.218165 0.010340 0.524469 -0.345150 0.340879 0.101686 -0.703296 -0.709743 -0.144215 -0.763553 -0.421338 -0.374730 0.607231 -0.253906 -0.244871 -0.403106 -0.353794 -0.224617 -0.223804 -0.239387 0.274349 0.225902 0.220374 0.241637 0.237503 0.220129 0.228721 0.314768 0.241617 0.288583 0.230611 0.237718 0.234381 0.239939 0.229329 0.225206 0.229891
chargesum: 0.00000
title: Mulliken charges with hydrogens summed into heavy atoms:
elementType: Cl O C C C C C C C C C C C C C C C C C C C
charge: -0.081589 -0.218165 0.010340 0.524469 -0.070801 0.340879 0.101686 -0.015383 -0.023391 -0.144215 -0.448785 -0.179721 -0.086147 0.607231 -0.023294 -0.007153 -0.168725 -0.113855 0.004713 0.001402 -0.009496
polarizability: 2.57910795e+02 1.62867387e+01 2.12519904e+02 1.20518657e+01 1.51042259e+01 1.69304820e+02
1716.lowfreq: -2.9953 0.0015 0.0018 0.0023 6.9051 7.6465 21.1770 31.9911 37.4090
frequency: 20.8006 31.9762 37.3548 55.0618 94.9132 108.5091 125.5958 149.8202 167.7530 202.4979 224.1388 237.4531 253.8231 261.5894 279.4666 298.4013 314.3731 338.7214 366.6226 401.6499 428.3146 459.3494 468.9385 479.9264 499.4103 528.5147 554.3385 587.0184 595.6445 614.2851 657.4019 685.5389 697.9272 705.9972 725.4678 774.3679 780.8159 787.8949 803.5173 835.8816 849.2432 897.6108 908.0335 917.3234 927.8115 929.6070 933.4463 977.5579 978.0782 987.0297 992.5417 997.0515 1005.8666 1010.0235 1026.3015 1037.7202 1077.4734 1084.9322 1108.8527 1113.5407 1137.2308 1172.9684 1174.2618 1177.3013 1188.6447 1194.2288 1208.2717 1253.0966 1262.8109 1283.3686 1311.5761 1335.9093 1364.9933 1374.4336 1386.6927 1389.5925 1397.5854 1439.7540 1444.2181 1462.4556 1463.6241 1470.4853 1478.1009 1481.6897 1489.4257 1535.9414 1579.4181 1594.4537 1610.4042 1614.4414 1660.8666 2983.0561 2985.1654 3080.4106 3084.3390 3090.4399 3091.2624 3095.6191 3102.5672 3124.4513 3126.1417 3130.3259 3140.5049 3141.1160 3151.0833 3152.9462 3165.9319 3167.6207
redmass: 5.0315 4.0657 5.8982 4.5341 5.4498 4.4021 6.6374 5.0677 2.7893 6.3938 1.1752 4.4381 1.8831 1.4212 6.9410 3.0098 3.2020 5.5365 6.2724 2.7830 3.2982 6.0809 4.9901 3.0570 4.0089 4.2002 3.2272 5.6184 5.8708 6.2569 5.2629 5.1126 1.7753 4.6756 3.5993 1.6975 2.0657 3.3591 4.1015 3.8478 1.2612 1.5135 2.7302 2.2821 1.4122 1.5834 1.6328 1.3988 1.3934 2.8868 4.6368 1.3474 1.3313 1.3032 2.2096 2.3541 2.6850 1.6516 3.5583 2.0001 1.6044 1.0589 1.2413 1.1560 1.1260 2.3668 1.9803 1.7752 2.5148 1.7061 2.3858 1.3721 2.1328 1.1675 8.4044 5.1062 1.2797 2.4279 2.1642 1.0518 1.0493 2.0129 1.0551 2.2830 1.2326 10.8556 7.3789 6.0505 6.0881 6.3595 8.5834 1.0340 1.0344 1.1004 1.0998 1.0860 1.1009 1.1006 1.0902 1.0845 1.0857 1.0876 1.0897 1.0921 1.0966 1.0940 1.1016 1.1002
irintensity: 0.8223 0.2956 2.1671 0.2236 0.2844 3.5883 1.6925 2.2393 0.0294 0.5235 0.0445 0.2473 0.7210 0.5304 6.1907 1.2249 0.1863 10.3690 1.0581 0.1249 3.7494 3.7871 3.6213 0.3673 9.5661 9.0144 5.6846 54.4419 23.8620 2.3165 16.3999 9.8497 48.8626 38.7317 27.1792 48.6503 15.8183 8.4588 25.0213 6.9815 0.0734 0.1994 6.6802 3.6212 4.3184 2.0115 3.1814 0.5032 1.6558 24.4370 3.9658 0.9372 0.1041 0.5018 7.4780 5.6723 8.3949 5.5571 2.1703 3.6616 8.8124 0.3477 10.1575 5.5072 5.5522 10.3286 9.3052 29.4624 75.7233 14.0528 1.1710 19.1158 50.0290 14.3995 11.9079 3.0180 4.1655 19.1256 9.5880 0.8679 5.4362 0.0284 15.5963 6.0777 24.7342 156.4934 19.8074 0.4430 0.9028 16.7296 42.5394 20.8693 35.2385 1.6285 47.2078 0.4860 19.1509 26.7773 7.1885 1.9615 2.6660 0.1433 15.5472 17.0589 35.3531 11.0088 23.4986 27.9168
temp: 298.150 k
press: 1.00000 atm
elementType: 17 8 6 6 6 6 6 6 6 6 6 6 6 6 6 6 6 6 6 6 6 1 1 1 1 1 1 1 1 1 1 1 1 1 1 1 1 1
symmnumber: 1
zpe: 790446.6 jmol-1
zpe.correction: 0.301065 hartree
zpe.thermalcorrener: 0.319783 hartree
zpe.thermalcorrenthalpy: 0.320727 hartree
zpe.thermalcorrgfe: 0.252778 hartree
zpe.sumelectzpe: -1268.035890 hartree
zpe.sumelectthermal: -1268.017172 hartree
zpe.sumelectthermalent: -1268.016228 hartree
zpe.sumelectthermalfe: -1268.084178 hartree
dipole: 3.0309 0.6050 3.0673
dipole: 4.3544
quadrupole: -113.0163 -130.0393 -128.0901
quadrupole: 8.1377 0.1229 3.0915
quadrupole: 10.6990 -6.3241 -4.3749 8.1377 0.1229 3.0915
hfenergy: -1268.3369551 hartree
pointgroup: C01 [X(C19H17Cl1O1)]
dipole: 0.9810498 1.1932857 0.7405966 debye
polarizability: 249.9761026|28.146212|214.1920975|4.0414234|-20.2091712|175.5673201 unknown
InChI: InChI=1S/C19H17ClO/c1-19(2)12-15(17(20)13-8-4-3-5-9-13)18(21)14-10-6-7-11-16(14)19/h3-12,17H,1-2H3
charge 0 multiplicity 1
38 atoms
Cl -2.303326 0.478562 -2.775179
O  0.155161 -2.201819 0.039962
C  1.524387 1.804911 -0.609816
C  2.36456 0.774767 0.153969
C  0.185408 1.259401 -1.057533
C  -0.281666 -0.001982 -0.832128
C  1.896492 -0.55215 0.374328
C  2.290807 2.283786 -1.889325
C  1.236868 3.047577 0.301221
C  0.562917 -1.003442 -0.12147
C  -1.644218 -0.522135 -1.252103
C  3.644217 1.12786 0.654147
C  2.699308 -1.490212 1.079286
C  -2.699958 -0.502232 -0.166538
C  4.437028 0.195527 1.353079
C  3.963632 -1.12367 1.568553
C  -3.55148 -1.624233 -0.008565
C  -2.864108 0.615622 0.690496
C  -4.552117 -1.630364 0.987058
C  -3.867783 0.613515 1.681993
C  -4.715005 -0.509714 1.833881
H  -0.442115 1.957707 -1.628533
H  3.243596 2.769926 -1.615013
H  1.680773 3.015772 -2.449446
H  2.514041 1.433277 -2.556248
H  0.705065 2.747951 1.221188
H  0.616462 3.784447 -0.24102
H  2.179081 3.543741 0.592614
H  -1.5387 -1.538733 -1.659307
H  4.029699 2.141216 0.496769
H  2.296259 -2.497922 1.223091
H  5.422148 0.492703 1.729745
H  4.579344 -1.848398 2.111525
H  -3.42091 -2.495235 -0.661103
H  -2.207033 1.485091 0.57893
H  -5.200534 -2.505594 1.1039
H  -3.989749 1.482844 2.337889
H  -5.491849 -0.512369 2.606699
