program: Gaussian 09
title: 000288961
version: EM64L-G09RevD.01
frameworkgroup: C1[X(C19H16Br2O)]
method: RPBEPBE
basis: SDD
operation: Freq
keyword: #p
keyword: freq=noraman
keyword: PBEPBE/SDD
title: #p freq=noraman PBEPBE/SDD
converged: YES YES NO NO
title: Mulliken charges:
elementType: Br Br O C C C C C C C C C C C C C C C C C C C H H H H H H H H H H H H H H H H
charge: -0.030012 -0.003421 -0.218011 0.001738 0.525782 -0.338497 0.355602 0.102858 -0.708115 -0.698613 -0.148876 -0.848642 -0.420035 -0.373633 0.600471 -0.252272 -0.243930 -0.273435 -0.391644 -0.199432 -0.213604 -0.212702 0.269272 0.228615 0.221069 0.241199 0.242042 0.221931 0.228002 0.341225 0.242295 0.288931 0.231711 0.238790 0.261381 0.239892 0.238082 0.253988
chargesum: 0.00000
title: Mulliken charges with hydrogens summed into heavy atoms:
elementType: Br Br O C C C C C C C C C C C C C C C C C C C
charge: -0.030012 -0.003421 -0.218011 0.001738 0.525782 -0.069226 0.355602 0.102858 -0.017233 -0.006638 -0.148876 -0.507417 -0.177740 -0.084701 0.600471 -0.020561 -0.005140 -0.012055 -0.151752 -0.199432 0.024478 0.041286
polarizability: 2.57726819e+02 1.66685951e+01 2.23238895e+02 1.78931232e+01 8.26382204e+00 2.38763072e+02
1716.lowfreq: -4.9810 -0.7560 -0.0003 -0.0002 0.0002 4.8996 10.8448 16.6847 29.0842
frequency: 9.9806 16.6188 29.0646 45.0353 66.6678 88.9980 104.0044 115.8379 160.8579 164.8152 167.1059 191.0055 213.5868 226.2201 245.3548 257.3109 285.6355 294.8765 304.8715 315.2949 342.6652 367.7589 427.9509 429.5899 462.7239 471.2002 483.0319 510.1958 527.0002 554.0397 585.9695 594.4550 647.7384 660.9232 677.6353 692.0347 706.1937 728.8100 774.8048 786.9006 795.1944 815.4137 853.9721 894.1720 898.9021 908.1554 913.8207 922.6783 931.2568 934.7777 979.0742 983.1088 984.0189 987.2578 1007.1103 1013.7735 1037.4148 1066.7304 1077.6843 1093.5222 1105.5330 1113.3403 1129.1950 1157.4135 1177.2592 1182.3753 1191.3419 1205.7446 1251.0021 1261.2091 1273.6819 1309.4723 1317.6136 1360.9887 1378.0458 1381.5834 1386.9456 1399.0592 1425.2133 1439.9333 1458.9365 1462.1333 1464.3966 1469.7776 1478.9503 1487.9856 1534.9279 1571.6367 1579.2258 1598.1719 1614.0942 1658.6819 2983.2739 2985.1063 3079.8670 3083.6634 3091.3330 3091.6632 3095.8318 3099.0498 3126.4601 3138.8835 3140.9740 3153.4485 3156.5763 3165.3344 3168.1563 3176.5997
redmass: 5.3351 8.0424 6.7548 5.7170 11.0382 6.1128 5.0899 4.3863 4.6595 2.6139 7.8174 6.0204 1.2656 5.7190 1.0789 3.0817 4.6655 4.5361 4.5422 3.2871 5.8016 6.1158 3.2249 3.2313 7.0829 4.3849 3.1743 5.6639 4.2819 3.2214 5.7579 6.1377 6.1592 5.7209 4.5827 2.5930 4.2499 3.6391 1.5643 4.1591 1.4825 3.8087 4.5914 1.5563 1.5236 2.6607 1.6055 2.1379 1.6071 1.4039 1.3949 2.9819 1.7884 2.5428 1.3415 1.2930 2.4080 2.2741 2.7415 1.6338 3.4540 1.9582 1.3879 1.5925 1.0785 1.0985 2.3375 2.0248 1.6628 2.4438 1.4916 2.2781 1.6362 2.2559 1.1695 5.3872 8.1525 1.2486 2.2446 2.4038 2.3845 1.0544 1.0502 1.9316 1.0538 1.2631 10.8364 6.3872 7.3134 6.6085 6.3318 8.4927 1.0343 1.0345 1.1003 1.0997 1.0857 1.1002 1.1005 1.0903 1.0858 1.0874 1.0897 1.0939 1.0936 1.0918 1.1002 1.0982
irintensity: 0.5711 0.9346 1.3531 1.0915 0.8832 0.5937 3.3187 0.7022 0.1943 0.1189 0.3847 1.5499 0.0215 2.9633 0.2046 1.3979 1.5706 3.2240 4.8019 0.2821 9.3627 0.5440 4.9729 2.2092 7.5701 12.4712 1.6824 23.7742 10.9206 5.3231 14.1762 26.4138 19.4562 5.0089 25.6609 22.9736 39.8712 48.2060 63.9560 1.4293 19.0459 3.8500 8.7564 4.2008 0.3661 6.9214 3.0146 12.1801 9.1449 3.0702 1.8987 9.5842 3.1461 27.6684 0.1565 0.3936 5.8307 24.8390 4.1123 2.3741 1.8625 3.2291 5.3850 35.6873 3.3258 0.9460 21.4391 29.0947 29.5088 67.1334 27.4260 1.6573 26.2488 55.7082 13.3449 5.3928 13.4035 2.9074 25.2149 20.2677 18.9291 0.2504 5.7527 0.2079 16.4820 25.7551 153.0331 39.2872 16.8771 6.3495 18.9165 44.7515 19.4238 32.5826 3.4193 42.0599 2.0949 15.7080 27.5016 10.6359 2.8014 4.2683 14.4846 10.2150 9.1181 1.0106 28.2469 9.2583
temp: 298.150 k
press: 1.00000 atm
elementType: 35 35 8 6 6 6 6 6 6 6 6 6 6 6 6 6 6 6 6 6 6 6 1 1 1 1 1 1 1 1 1 1 1 1 1 1 1 1
symmnumber: 1
zpe: 761990.7 jmol-1
zpe.correction: 0.290227 hartree
zpe.thermalcorrener: 0.310822 hartree
zpe.thermalcorrenthalpy: 0.311767 hartree
zpe.thermalcorrgfe: 0.236857 hartree
zpe.sumelectzpe: -834.224702 hartree
zpe.sumelectthermal: -834.204106 hartree
zpe.sumelectthermalent: -834.203162 hartree
zpe.sumelectthermalfe: -834.278072 hartree
dipole: -2.8119 -1.6898 -1.4612
dipole: 3.5913
quadrupole: -129.5297 -153.8154 -141.7604
quadrupole: 9.0387 13.9255 1.5065
quadrupole: 12.1722 -12.1136 -0.0586 9.0387 13.9255 1.5065
hfenergy: -834.5149289 hartree
pointgroup: C01 [X(C19H16Br2O1)]
dipole: 1.2084468 -0.6040692 -0.4136698 debye
polarizability: 262.9584726|-19.5794051|238.6988536|-8.4315663|2.3199084|218.0714596 unknown
InChI: InChI=1S/C19H16Br2O/c1-19(2)11-15(17(21)12-6-5-7-13(20)10-12)18(22)14-8-3-4-9-16(14)19/h3-11,17H,1-2H3
charge 0 multiplicity 1
38 atoms
Br -1.964454 -0.682939 3.127396
Br -3.831118 -1.715334 -2.799858
O  0.406384 2.34981 0.434767
C  1.810353 -1.697787 0.455145
C  2.610544 -0.565497 -0.19813
C  0.481352 -1.234915 1.011481
C  0.005957 0.043591 0.998789
C  2.130271 0.775505 -0.209766
C  1.514091 -2.828235 -0.587716
C  2.623858 -2.308352 1.648264
C  0.82205 1.143766 0.404903
C  -1.338756 0.498102 1.535151
C  3.867123 -0.834193 -0.798991
C  2.896789 1.809487 -0.814284
C  -2.454582 0.562039 0.513825
C  4.62363 0.193092 -1.397906
C  4.137216 1.525135 -1.407799
C  -2.593832 -0.431375 -0.489319
C  -3.375904 1.638466 0.560049
C  -3.648265 -0.330649 -1.413693
C  -4.423809 1.721852 -0.379806
C  -4.573463 0.733258 -1.380811
H  -0.119963 -2.018195 1.494267
H  2.454405 -3.274976 -0.95514
H  0.914892 -3.632628 -0.122942
H  0.957411 -2.431646 -1.454728
H  2.847901 -1.538538 2.406763
H  2.047576 -3.118139 2.131992
H  3.578213 -2.732448 1.289829
H  -1.220079 1.480844 2.015766
H  4.263306 -1.855834 -0.801777
H  2.485857 2.824012 -0.797982
H  5.590702 -0.040637 -1.856975
H  4.724628 2.322876 -1.874242
H  -1.88856 -1.265046 -0.541043
H  -3.264125 2.411056 1.328652
H  -5.129579 2.558178 -0.343749
H  -5.383618 0.793696 -2.112886
