program: Gaussian 09
title: 000290216
version: EM64L-G09RevD.01
frameworkgroup: C1[X(C7H9NO3S)]
method: RPBEPBE
basis: SDD
operation: Freq
keyword: #p
keyword: freq=noraman
keyword: PBEPBE/SDD
title: #p freq=noraman PBEPBE/SDD
converged: NO YES NO NO
title: Mulliken charges:
elementType: S O O O N C C C C C C C H H H H H H H H H
charge: 0.201389 -0.289925 -0.117727 -0.340286 -0.591367 -0.479446 0.216382 -0.232636 -0.067654 0.210395 -0.216036 -0.675005 0.276963 0.276948 0.226203 0.226218 0.320933 0.385602 0.211602 0.228722 0.228724
chargesum: 0.00000
title: Mulliken charges with hydrogens summed into heavy atoms:
elementType: S O O O N C C C C C C C
charge: 0.201389 -0.289925 -0.117727 -0.340286 0.115169 0.074464 0.216382 -0.232636 -0.067654 0.210395 0.236385 -0.005957
polarizability: 1.56226491e+02 -4.69379156e+00 1.28556830e+02 -1.83839574e-03 7.55991858e-03 5.66081115e+01
1716.lowfreq: -0.0008 -0.0005 0.0015 7.3083 9.5662 16.4073 46.5020 73.2229 84.8243
frequency: 46.2208 73.1987 84.8088 93.1064 141.4587 150.7734 237.1767 243.0452 270.4343 272.0419 336.2247 370.2161 398.7659 411.7496 447.2992 467.0496 469.8624 554.4983 568.0709 676.9812 699.8707 711.9454 777.3435 799.3785 806.2500 880.8479 901.9881 998.5667 1022.5120 1060.6225 1111.0966 1136.2158 1138.9735 1218.3981 1248.1893 1248.5650 1305.1092 1342.6118 1379.6080 1402.4610 1418.8134 1464.0717 1474.5302 1487.8776 1513.5607 1598.8024 1628.5824 1700.6762 2983.4819 2995.8624 3008.6894 3026.5987 3066.3158 3092.1152 3107.4212 3321.6502 3648.9986
redmass: 2.6952 2.5652 7.2825 4.4197 3.8689 4.7779 4.8311 1.3236 4.2848 2.6330 7.1474 6.7318 5.4260 1.2141 9.4212 8.7932 3.5177 5.8144 5.0470 5.8181 3.9270 6.5202 1.3175 1.1019 3.9621 3.4712 2.1558 5.3956 2.2482 3.6212 2.2094 1.4394 1.1186 1.6738 2.3027 1.1339 4.5284 2.1627 2.0916 1.2910 1.1304 1.0403 1.0602 1.0723 2.5343 2.5963 3.4618 12.7542 1.0603 1.0359 1.0581 1.0982 1.1067 1.0984 1.1024 1.0602 1.0906
irintensity: 0.3234 0.7046 3.6838 0.3925 1.1438 6.5846 8.9682 4.8528 1.1990 5.3435 8.7177 9.5234 9.8490 133.0865 7.4542 30.6398 0.0841 42.1375 30.3055 11.4809 2.8222 0.5766 144.7863 2.2027 10.2705 57.7332 2.0615 58.6487 24.3881 379.8366 1.8009 5.0347 0.3906 25.8159 272.8536 0.0308 83.6707 22.1101 40.2013 13.1760 12.3332 12.2947 10.0868 6.8571 435.8283 75.2062 497.4437 307.4801 11.5362 23.1019 24.3675 1.5369 9.9829 32.1685 46.2963 107.6955 106.7290
temp: 298.150 k
press: 1.00000 atm
elementType: 16 8 8 8 7 6 6 6 6 6 6 6 1 1 1 1 1 1 1 1 1
symmnumber: 1
zpe: 406979.0 jmol-1
zpe.correction: 0.155010 hartree
zpe.thermalcorrener: 0.167631 hartree
zpe.thermalcorrenthalpy: 0.168575 hartree
zpe.thermalcorrgfe: 0.115390 hartree
zpe.sumelectzpe: -949.739832 hartree
zpe.sumelectthermal: -949.727211 hartree
zpe.sumelectthermalent: -949.726267 hartree
zpe.sumelectthermalfe: -949.779452 hartree
dipole: 1.8803 1.6272 -0.0004
dipole: 2.4867
quadrupole: -75.8579 -77.3613 -77.6231
quadrupole: -14.3234 -0.0002 -0.0035
quadrupole: 1.0895 -0.4138 -0.6757 -14.3234 -0.0002 -0.0035
hfenergy: -949.8948423 hartree
pointgroup: C01 [X(C7H9N1O3S1)]
dipole: -0.7704642 0.602914 0.0001609 debye
dipolederiv: -0.3139503 -0.0785623 0.0000607 0.2292445 -0.9314 0.0001022 0.0000227 0.000037 -0.0036163 -1.6965248 -0.4708832 -0.0001431 -0.8052401 -0.766531 0.0000547 -0.0005849 -0.0001995 -0.285675 -0.6360885 0.5300642 0.00004 0.4614681 -1.2079517 -0.0000063 -0.0001761 0.0004549 -0.2597928 -0.8930734 0.165574 0.0000721 0.3316561 -0.9581333 -0.0001478 -0.0003798 0.0003945 -0.3576327 -0.4444922 0.2210803 -0.0001233 -0.4776588 -1.264971 0.0000931 0.0000386 -0.0000037 -0.5880008 -0.3087785 -0.0273474 0.0000867 -0.2194857 0.0023701 0.0000833 0.000356 0.0001346 0.1702188 -1.5851312 -0.230607 0.0000807 -0.1921588 -0.3158163 0.0000164 0.000307 0.0000888 -0.1820741 1.1817288 -0.2768703 -0.0001216 0.6277326 1.3088024 -0.000125 -0.0002744 -0.0000304 0.0355846 0.7097702 -0.1760895 -0.0001343 -0.3634772 1.9757254 -0.0001476 0.0000272 -0.0005883 0.1472124 2.3635456 0.2284168 -0.0000492 0.210804 1.2327867 0.0000801 0.0003787 -0.0003038 0.2450888 1.086303 0.2083326 0.0001311 0.0412563 0.2602963 0.0000241 0.0002634 0.0001007 0.3555467 -0.0746572 -0.1015149 -0.000013 -0.0712866 -0.0436789 -0.0000363 -0.0000457 -0.0000391 0.0618464 0.0941466 -0.016504 0.0293215 0.0261446 0.020851 0.0602253 0.02033 0.0866393 0.0289071 0.0941593 -0.0165999 -0.0293561 0.0260955 0.0208184 -0.0602561 -0.0203936 -0.0866626 0.0289638 -0.0773437 -0.0394213 0.0046597 0.0537837 0.0016158 -0.0941203 0.0494593 -0.0934364 -0.0643656 -0.0772878 -0.0394982 -0.0046186 0.0536935 0.0016448 0.0941223 -0.04945 0.0933843 -0.0644063 0.1914235 0.0009077 0.00005 0.0178815 0.3120457 -0.0000068 0.0000022 -0.0000545 0.3843857 0.3435553 0.011341 0.0000409 0.0404345 0.2698405 0.0000326 0.0000884 0.0000411 0.3631825 -0.1897508 0.0093093 -0.0001056 0.0324077 0.0684412 0.0000244 -0.0001247 0.0000079 0.1153648 0.1161879 0.0494864 0.0614044 -0.0116053 0.006612 -0.091498 0.0338674 -0.1098141 -0.0653182 0.1162584 0.0493859 -0.0612831 -0.0116901 0.0066319 0.0914856 -0.0337116 0.1098494 -0.0654198 unknown
polarizability: 155.6963934|6.034758|129.0869277|-0.0014631|-0.0076414|56.6081115 unknown
InChI: InChI=1S/C7H9NO3S/c1-2-11-7(10)4-3-5(9)12-6(4)8/h2-3,8H2,1H3
charge 0 multiplicity 1
21 atoms
S  3.077461 0.480739 -0.000174
O  -1.890393 -0.47841 0.000353
O  3.074748 -2.301355 0.00039
O  -1.431297 1.823373 -0.000173
N  1.202012 2.519998 0.00004
C  0.830726 -1.226016 0.000488
C  0.376106 0.208647 0.000401
C  1.388114 1.169323 0.000061
C  2.35379 -1.297741 -0.000057
C  -1.00965 0.615928 0.000664
C  -3.344669 -0.141696 -0.000236
C  -4.102731 -1.465847 -0.000459
H  0.468809 -1.789963 0.883308
H  0.468236 -1.790275 -0.881898
H  -3.562566 0.470653 0.893579
H  -3.561874 0.470551 -0.894291
H  1.976681 3.177912 -0.000121
H  0.214808 2.827986 0.000384
H  -5.191263 -1.273402 -0.000906
H  -3.855467 -2.062205 -0.895298
H  -3.856183 -2.062097 0.894649
