program: Gaussian 09
title: 000291490
version: EM64L-G09RevD.01
frameworkgroup: C1[X(C22H18N2O4)]
method: RPBEPBE
basis: SDD
operation: Freq
keyword: #p
keyword: freq=noraman
keyword: PBEPBE/SDD
title: #p freq=noraman PBEPBE/SDD
converged: YES YES NO NO
title: Mulliken charges:
elementType: O O O O N N C C C C C C C C C C C C C C C C C C C C C C H H H H H H H H H H H H H H H H H H
charge: -0.247978 -0.248568 -0.230375 -0.230153 -0.021515 -0.021276 0.459146 0.459830 -0.479852 -0.479827 -0.363567 -0.381623 -0.380830 -0.363754 0.142049 0.141800 -0.231364 -0.225051 -0.225183 -0.231267 -0.285301 -0.236074 -0.285418 -0.235756 -0.230682 -0.230732 0.112146 0.111950 0.246353 0.229109 0.229110 0.246510 0.275541 0.235664 0.235767 0.275781 0.231615 0.228783 0.228777 0.231633 0.273466 0.267869 0.273475 0.268012 0.230869 0.230891
chargesum: 0.00000
title: Mulliken charges with hydrogens summed into heavy atoms:
elementType: O O O O N N C C C C C C C C C C C C C C C C C C C C C C
charge: -0.247978 -0.248568 -0.230375 -0.230153 -0.021515 -0.021276 0.459146 0.459830 -0.004390 -0.004207 -0.088026 -0.145959 -0.145063 -0.087973 0.142049 0.141800 0.000251 0.003732 0.003594 0.000366 -0.011835 0.031795 -0.011943 0.032256 0.000187 0.000159 0.112146 0.111950
polarizability: 3.52317250e+02 2.57793484e-03 2.98233237e+02 -1.14757893e-01 5.04022858e+00 2.06956999e+02
1716.lowfreq: -8.3509 -6.7414 -5.3621 -0.0003 0.0002 0.0005 2.7648 6.3528 12.6879
frequency: -6.4347 5.9870 12.6779 15.9135 32.0318 33.6499 42.7180 58.6398 63.2094 82.3844 84.5029 120.8056 122.2422 161.1600 178.8892 220.4619 223.5770 240.4599 245.7276 299.5870 317.9637 352.8900 364.1307 390.8519 401.0326 404.2639 405.1130 437.1375 467.8598 478.6947 494.1538 537.1175 548.2879 548.9238 592.8577 596.0194 616.5772 616.7397 624.1390 626.5994 702.0681 704.0279 704.9453 713.7228 748.5956 750.7770 759.2142 764.0934 771.0494 787.9094 815.4408 815.7309 830.8597 831.8916 860.1326 860.6821 864.4645 919.8365 920.8338 937.8032 938.4264 951.0848 975.0226 975.9872 981.6579 984.6530 984.7569 990.3600 990.4595 1000.8413 1002.3626 1002.6670 1026.9831 1027.1125 1091.0504 1091.1216 1093.4153 1126.4953 1139.2613 1173.7951 1174.3216 1190.5839 1190.7831 1192.5912 1221.9693 1222.0996 1230.2477 1230.3586 1272.3281 1331.2105 1331.3307 1332.0853 1340.5260 1341.5164 1379.5437 1384.8623 1384.9008 1408.8480 1442.2470 1442.3141 1461.1140 1461.3339 1484.3929 1484.5109 1543.2361 1580.5420 1580.9975 1587.6815 1593.6716 1593.7561 1599.6619 1613.5914 1613.6236 1647.1577 3037.7115 3037.9338 3114.9635 3115.1190 3122.0203 3122.1236 3129.9939 3130.0859 3137.9987 3142.1484 3142.2973 3153.1365 3153.3089 3159.6533 3161.4352 3166.4864 3166.6211 3184.0365
redmass: 5.1875 5.2925 5.1750 6.2723 4.3000 4.8084 8.9017 4.7506 5.1174 6.2791 10.4915 6.9748 5.5147 6.0547 6.5873 6.5728 6.6346 5.5835 9.0775 5.7143 5.1929 2.4660 2.2558 3.3942 3.3943 2.8235 2.9817 7.5010 4.3272 4.0373 2.8887 7.1198 7.4451 4.5789 5.7839 5.3913 6.4762 6.3697 5.3247 5.9824 7.1263 1.8013 1.8889 8.7966 4.8086 2.6069 2.8016 4.6380 3.3692 1.5070 3.5071 3.5182 5.2340 5.5721 1.2477 1.2936 1.7257 3.7985 4.3865 1.6136 1.6307 3.5547 1.8659 1.9067 1.3470 1.4187 1.4222 5.6794 5.6132 1.2974 1.3270 1.3250 2.2193 2.2211 1.5531 1.5322 1.5782 7.0966 3.9781 1.0541 1.0544 1.1237 1.1193 1.2052 2.8220 2.8245 1.1501 1.1505 1.6518 1.3737 1.2622 2.1231 1.2604 1.2851 1.6097 8.1909 8.1910 3.3238 2.1801 2.1796 1.1374 1.1379 2.2836 2.2790 11.2300 9.6244 9.4419 7.9408 6.1148 6.0843 9.3859 6.0316 6.0253 6.7784 1.0589 1.0589 1.1072 1.1072 1.0868 1.0868 1.0875 1.0876 1.0876 1.0920 1.0920 1.0963 1.0963 1.1000 1.0880 1.1016 1.1016 1.1005
irintensity: 0.3549 0.0111 0.0223 0.0988 0.0433 0.0823 1.9290 0.4976 2.7562 0.2024 1.9788 3.4242 5.7512 3.3779 3.9386 5.5134 1.8130 1.7086 7.7589 14.9834 5.2413 4.3569 6.5249 23.7145 5.4474 0.1051 3.0751 6.8659 5.1037 2.3548 27.2045 0.5081 1.8433 23.0062 3.4732 30.7173 0.1788 0.0081 7.3905 39.7486 2.8902 103.5716 31.2364 22.5050 46.4644 42.1677 32.1591 19.7094 5.6903 3.6385 0.3256 18.2296 7.8481 0.0025 0.3008 14.1085 53.0791 199.6123 171.9602 6.3923 15.4830 17.0729 32.1790 48.9645 0.0201 6.9183 6.2460 0.4015 0.0992 0.0214 2.0471 1.0809 0.2181 6.1281 53.0312 18.7529 140.2811 663.8168 556.1287 0.0026 0.1531 0.0441 1.4442 47.2934 3.4314 37.0204 0.7961 6.4099 0.5454 7.9580 0.2943 4.5750 37.2000 1.7449 8.7193 0.2114 1.4503 1.0793 0.6201 20.4798 56.8329 12.3268 1.1981 14.5660 62.6746 175.7358 82.3299 10.4529 5.0927 0.5655 458.4205 0.0962 0.2464 17.1649 44.0905 27.6481 4.7757 5.4338 3.5013 5.7022 2.0505 2.4351 0.0054 3.4353 30.6364 5.4787 34.9019 0.9694 0.0473 2.5756 33.1772 4.9878
temp: 298.150 k
press: 1.00000 atm
elementType: 8 8 8 8 7 7 6 6 6 6 6 6 6 6 6 6 6 6 6 6 6 6 6 6 6 6 6 6 1 1 1 1 1 1 1 1 1 1 1 1 1 1 1 1 1 1
symmnumber: 1
zpe: 914811.8 jmol-1
zpe.correction: 0.348433 hartree
zpe.thermalcorrener: 0.372251 hartree
zpe.thermalcorrenthalpy: 0.373195 hartree
zpe.thermalcorrgfe: 0.288616 hartree
zpe.sumelectzpe: -1257.538950 hartree
zpe.sumelectthermal: -1257.515133 hartree
zpe.sumelectthermalent: -1257.514189 hartree
zpe.sumelectthermalfe: -1257.598768 hartree
dipole: -0.0186 4.2884 -2.5910
dipole: 5.0104
quadrupole: -173.7841 -149.5994 -158.7823
quadrupole: 0.0693 -0.0578 5.3828
quadrupole: -13.0621 11.1225 1.9396 0.0693 -0.0578 5.3828
hfenergy: -1257.8873836 hartree
pointgroup: C01 [X(C22H18N2O4)]
dipole: -0.010305 1.6272079 -1.1126084 debye
polarizability: 352.2989342|-0.2752649|298.5119571|-1.5739107|-0.1145611|206.6965946 unknown
InChI: InChI=1S/C22H18N2O4/c25-21(27-15-17-7-3-1-4-8-17)23-19-11-13-20(14-12-19)24-22(26)28-16-18-9-5-2-6-10-18/h1-14H,15-16H2
charge 0 multiplicity 1
46 atoms
O  -3.812632 -1.024632 -0.749141
O  3.77361 -1.055831 -0.827207
O  -4.288026 -1.493349 1.508533
O  4.311678 -1.539504 1.413274
N  -2.777613 -2.809751 0.277958
N  2.754849 -2.837913 0.221817
C  -4.246687 1.397928 -0.335322
C  4.241102 1.361745 -0.422039
C  -4.855823 0.071613 -0.730624
C  4.827221 0.030547 -0.83533
C  -4.140445 1.762146 1.033089
C  3.760591 2.267678 -1.40179
C  -3.77532 2.29386 -1.328637
C  4.16537 1.720451 0.949878
C  -1.456246 -2.733101 0.262703
C  1.434202 -2.747701 0.233178
C  -3.568415 3.000845 1.397823
C  3.210626 3.511932 -1.020491
C  -3.204241 3.5336 -0.964097
C  3.614145 2.963507 1.331373
C  -0.703668 -3.985363 0.102751
C  -0.687832 -1.479709 0.404426
C  0.665898 -3.992275 0.088807
C  0.681595 -1.486599 0.390395
C  -3.099825 3.889245 0.40091
C  3.136391 3.861981 0.347902
C  -3.650615 -1.726036 0.451121
C  3.641562 -1.762164 0.374156
H  -5.655549 -0.240436 -0.037132
H  -5.219375 0.073167 -1.769787
H  5.163043 0.030711 -1.883786
H  5.642168 -0.29032 -0.163887
H  -4.499252 1.06661 1.80006
H  3.817298 1.996867 -2.46333
H  -3.855582 2.018664 -2.387514
H  4.531452 1.017401 1.706505
H  -3.492493 3.275251 2.455801
H  2.845528 4.20644 -1.785209
H  -2.84621 4.220367 -1.739073
H  3.56156 3.233475 2.391914
H  -1.292164 -4.901715 0.000623
H  -1.243659 -0.541507 0.511549
H  1.24293 -4.914518 -0.025037
H  1.248946 -0.55403 0.485637
H  -2.660353 4.851968 0.685341
H  2.713159 4.828055 0.645309
