program: Gaussian 09
title: 000291488
version: EM64L-G09RevD.01
frameworkgroup: C1[X(C12H14N2O3)]
method: RPBEPBE
basis: SDD
operation: Freq
keyword: #p
keyword: freq=noraman
keyword: PBEPBE/SDD
title: #p freq=noraman PBEPBE/SDD
converged: YES YES NO NO
title: Mulliken charges:
elementType: O O O N N C C C C C C C C C C C C H H H H H H H H H H H H H H
charge: -0.254542 -0.212640 -0.244110 -0.209208 -0.048039 -0.422640 0.394729 -0.533306 0.172896 -0.677067 -0.374810 -0.026249 -0.295629 -0.161738 0.309159 -0.264173 -0.660933 0.251888 0.292992 0.249014 0.246466 0.264277 0.269632 0.245837 0.271072 0.242566 0.240050 0.230136 0.225555 0.229878 0.248936
chargesum: 0.00000
title: Mulliken charges with hydrogens summed into heavy atoms:
elementType: O O O N N C C C C C C C C C C C C
charge: -0.254542 -0.212640 -0.244110 -0.209208 -0.048039 0.122240 0.394729 -0.037826 0.172896 -0.143158 -0.128973 -0.026249 -0.024557 0.080828 0.309159 0.206012 0.043437
polarizability: 2.11561956e+02 2.74723162e+01 1.73596314e+02 1.04859251e+01 -5.64930458e+00 9.58919658e+01
1716.lowfreq: -10.3568 -2.3505 -0.0007 -0.0007 -0.0003 7.5306 12.0760 31.3605 50.6602
frequency: 6.2790 31.2730 50.6317 67.9554 96.6556 111.2526 130.7836 173.7141 198.4341 208.4325 239.9960 286.5899 299.9416 347.5620 396.5507 424.8118 428.6504 440.9995 461.5598 512.7371 517.7132 564.2780 599.2828 606.3675 652.8354 693.4680 710.4904 726.8757 767.9950 773.7239 800.9407 812.5928 839.1204 876.0525 896.5805 899.8044 933.2286 986.9607 989.5803 1011.6291 1015.2547 1047.0110 1063.3634 1095.0785 1115.1237 1127.4598 1154.4736 1156.6510 1178.0183 1207.4323 1218.2572 1231.3149 1247.9045 1272.5582 1278.4589 1303.7319 1317.7184 1356.9919 1369.2603 1391.6379 1392.1429 1421.2000 1445.4155 1457.1469 1459.0126 1462.5790 1474.9870 1483.5012 1512.3843 1556.4733 1593.1052 1630.4493 1641.9820 2979.5124 2995.3690 3008.1615 3035.4975 3040.0774 3090.5963 3097.1683 3099.4254 3101.9015 3116.4913 3124.3351 3151.1582 3180.0290 3195.7810
redmass: 4.5042 5.0189 3.2332 4.7889 5.2951 4.5781 4.1210 2.0745 3.4819 2.1641 2.8189 3.1810 2.9579 4.9675 3.3739 4.9138 2.9437 3.5800 3.6647 3.8783 3.8536 4.0453 5.2864 4.8766 4.6193 4.5492 4.1072 3.1812 2.7352 2.1346 2.2398 1.3398 3.8893 1.5877 2.7536 3.2944 2.1236 2.4844 1.4701 2.2789 2.9837 2.2621 2.3228 2.1918 1.8823 2.4619 1.3914 1.6422 2.3189 2.0135 1.9156 1.8554 1.7927 1.7352 1.1275 1.5281 1.3405 1.2981 1.5842 1.9097 1.2454 2.4427 1.0859 1.1007 1.1687 1.0435 1.0868 1.0522 5.3372 7.6244 9.0544 8.3017 7.4159 1.0671 1.0361 1.0638 1.0597 1.0623 1.0974 1.1028 1.0957 1.1004 1.1002 1.1070 1.0892 1.0942 1.0975
irintensity: 0.2331 2.3382 0.4325 5.8360 1.9778 3.4283 1.9111 2.4968 3.0356 5.9580 2.3005 2.0520 12.7771 11.3149 6.6728 1.1737 4.3040 1.1649 2.8835 1.8220 3.3617 6.5708 5.3182 1.0316 5.0436 14.9204 2.9675 14.2372 8.1731 31.0664 28.7448 3.3020 13.5785 0.8879 8.6509 10.0247 6.8267 37.1648 6.9448 6.1670 97.2186 7.2789 4.3104 33.7432 96.8342 188.0582 22.5487 27.2300 62.4225 108.1900 43.1744 107.2937 2.7176 3.6985 11.0008 83.1424 0.7464 4.3612 44.3394 8.9244 27.2093 12.8643 16.9158 11.0795 32.6870 14.7306 18.9986 13.5191 715.7702 105.3751 381.8056 174.1992 33.5163 21.0041 17.2785 14.5125 21.1790 6.7840 29.2525 1.9809 6.3793 6.7723 1.8509 27.1988 13.7368 2.8137 2.1519
temp: 298.150 k
press: 1.00000 atm
elementType: 8 8 8 7 7 6 6 6 6 6 6 6 6 6 6 6 6 1 1 1 1 1 1 1 1 1 1 1 1 1 1
symmnumber: 1
zpe: 642800.9 jmol-1
zpe.correction: 0.244830 hartree
zpe.thermalcorrener: 0.260601 hartree
zpe.thermalcorrenthalpy: 0.261545 hartree
zpe.thermalcorrgfe: 0.198616 hartree
zpe.sumelectzpe: -799.593771 hartree
zpe.sumelectthermal: -799.578000 hartree
zpe.sumelectthermalent: -799.577056 hartree
zpe.sumelectthermalfe: -799.639985 hartree
dipole: 10.2062 3.0411 1.3339
dipole: 10.7328
quadrupole: -126.2356 -96.5501 -94.9828
quadrupole: -10.8424 -4.1943 -3.4841
quadrupole: -20.3128 9.3727 10.9401 -10.8424 -4.1943 -3.4841
hfenergy: -799.8386012 hartree
pointgroup: C01 [X(C12H14N2O3)]
dipole: 3.9509408 -1.3174739 -0.6962861 debye
polarizability: 208.7388195|-28.3404725|175.9299548|-15.1870211|-1.0769326|96.3814616 unknown
InChI: InChI=1S/C12H14N2O3/c1-2-17-12(16)8-9-4-3-5-10-13-11(15)6-7-14(9)10/h3-5H,2,6-8H2,1H3
charge 0 multiplicity 1
31 atoms
O  3.499045 -0.409699 -0.20255
O  -4.282098 2.196516 0.357019
O  2.198394 1.478349 0.23333
N  -0.903008 -0.056327 -0.368298
N  -3.226988 0.10527 0.40817
C  -0.92525 1.41307 -0.667062
C  0.195127 -0.856171 -0.690018
C  -1.824205 2.149292 0.341979
C  -2.105842 -0.600691 0.19623
C  1.411439 -0.240009 -1.372575
C  0.179174 -2.216145 -0.392961
C  -3.223681 1.505139 0.354315
C  -2.07821 -2.010054 0.512612
C  -0.971794 -2.795656 0.232079
C  2.38266 0.395077 -0.371128
C  4.537264 0.067718 0.774539
C  5.521375 1.021588 0.094726
H  -1.320632 1.549014 -1.694103
H  0.099239 1.807459 -0.606933
H  -1.908908 3.212127 0.065727
H  -1.380468 2.08857 1.354347
H  1.11582 0.531264 -2.10395
H  1.943104 -1.037047 -1.912157
H  1.051864 -2.823245 -0.643663
H  -2.986746 -2.407442 0.970099
H  -0.976936 -3.862538 0.47743
H  4.019025 0.552698 1.619953
H  5.019897 -0.865365 1.104445
H  6.328678 1.28347 0.803285
H  5.98182 0.550886 -0.790882
H  5.020541 1.954885 -0.212304
