program: Gaussian 09
title: 000291478
version: EM64L-G09RevD.01
frameworkgroup: C1[X(C15H16BrNO2S)]
method: RPBEPBE
basis: SDD
operation: Freq
keyword: #p
keyword: freq=noraman
keyword: PBEPBE/SDD
title: #p freq=noraman PBEPBE/SDD
converged: YES YES NO NO
title: Mulliken charges:
elementType: Br S O O N C C C C C C C C C C C C C C C H H H H H H H H H H H H H H H H
charge: -0.006519 0.886385 -0.537991 -0.527580 -0.495279 -0.091835 0.469623 0.477216 0.594422 -0.554477 -0.669588 -0.029881 -0.834128 -0.849824 -0.832428 -0.248238 -0.247644 -0.203091 -0.206172 -0.216800 0.300676 0.246083 0.250906 0.249056 0.284171 0.226703 0.236923 0.284068 0.255060 0.256474 0.233154 0.283447 0.292402 0.242327 0.243783 0.238597
chargesum: 0.00000
title: Mulliken charges with hydrogens summed into heavy atoms:
elementType: Br S O O N C C C C C C C C C C C C C C C
charge: -0.006519 0.886385 -0.537991 -0.527580 -0.194603 -0.091835 0.469623 0.477216 0.594422 -0.554477 -0.423505 -0.029881 -0.049995 -0.102130 -0.087740 0.035209 0.044758 0.039236 0.037611 0.021797
polarizability: 3.05503209e+02 -8.31067535e+00 2.55397733e+02 -2.58950848e+01 -1.55068003e+00 1.49341014e+02
1716.lowfreq: -6.3707 -0.0014 -0.0013 -0.0011 5.8087 6.2886 14.8548 33.0933 36.6362
frequency: 14.7252 33.0425 36.5950 55.5666 72.0614 91.8451 114.8255 141.8519 155.9261 163.3892 174.6668 178.1955 181.0031 195.6588 209.2609 240.0997 244.8416 247.5448 293.4905 298.7849 332.2644 340.1006 371.1077 380.4624 403.6212 415.1572 420.3002 483.6208 502.8406 538.0356 540.7089 563.7212 592.7483 602.0121 624.6574 655.4694 690.3705 754.7960 760.5325 791.6740 801.0103 851.1348 875.7182 889.0841 927.9332 936.1690 956.5799 967.5127 977.6901 985.4078 1006.0147 1008.0923 1017.0240 1030.3377 1042.3233 1044.2616 1046.0265 1048.6965 1050.9204 1077.5009 1171.5819 1173.6179 1178.4952 1235.6822 1241.2989 1304.4148 1318.0372 1359.3044 1383.7323 1387.3120 1395.6785 1397.9319 1400.8683 1405.8474 1436.9616 1452.4986 1461.6598 1463.0397 1472.7029 1474.2751 1477.5014 1481.7889 1548.2872 1576.9826 1595.2618 1603.1820 2969.2557 2982.6009 2986.7774 3047.3898 3059.9321 3060.7229 3091.8521 3094.7000 3121.7018 3132.1388 3137.8440 3148.2957 3157.1061 3165.9746 3175.3753 3325.0215
redmass: 6.3887 8.1641 3.9342 5.1545 5.7598 4.0614 5.3662 6.8017 8.1369 1.4480 1.3659 3.4901 1.3577 1.4212 3.1269 5.0105 6.7056 5.4929 4.6177 2.7775 3.5766 5.1923 8.9016 3.8964 2.8289 5.6257 5.8055 5.7219 4.4594 3.1185 3.7572 3.8074 3.9711 6.4773 5.1358 6.7840 2.3967 3.7531 1.4322 6.9724 7.8283 1.2440 1.2948 1.6585 9.1333 1.3571 1.9657 3.8977 5.9023 1.3921 1.3406 4.0803 1.6133 1.9724 1.5336 1.5705 1.6579 1.8294 1.7283 1.5502 3.7754 1.0628 1.1338 1.4230 1.6369 1.2974 5.9047 4.2644 8.4433 2.0759 1.6862 1.3374 1.2609 2.1214 2.2477 2.0199 1.0480 1.1760 1.1223 1.0903 1.0882 1.1213 5.9677 5.8196 6.2905 6.9324 1.0399 1.0372 1.0386 1.0961 1.0966 1.0965 1.0975 1.0995 1.0976 1.0917 1.0858 1.0886 1.0928 1.0970 1.1016 1.0743
irintensity: 1.3827 1.6155 0.3860 0.8571 0.5134 1.0220 3.3445 2.6931 6.9350 3.5698 3.7526 2.1476 1.9942 2.4794 4.3241 16.8337 2.5704 9.9227 7.2793 0.5896 1.6161 0.2719 13.7899 5.2715 0.0631 39.2377 70.8095 14.9909 54.6134 2.9015 3.9118 1.8878 12.7531 0.0040 1.8465 3.4670 30.1008 0.9757 66.3515 29.6877 65.4232 0.3443 15.2950 77.7427 59.8216 1.6324 12.4557 85.9493 4.1023 0.0552 0.5721 1.4531 13.2173 1.8302 1.3098 4.4349 1.5131 31.8200 16.1123 4.9717 35.7650 0.2013 7.5496 6.6738 0.7973 3.0963 15.6075 3.2489 5.3713 26.3652 4.9302 21.7342 9.9581 5.8301 14.6499 15.0910 16.4099 18.5089 17.8984 21.9621 18.6631 26.4444 11.6863 6.8420 31.9736 0.4307 19.7068 18.5342 8.8009 8.0442 13.0131 7.8664 15.4985 21.1994 3.2073 20.5715 1.0904 10.7941 1.2382 3.3481 28.5301 13.5738
temp: 298.150 k
press: 1.00000 atm
elementType: 35 16 8 8 7 6 6 6 6 6 6 6 6 6 6 6 6 6 6 6 1 1 1 1 1 1 1 1 1 1 1 1 1 1 1 1
symmnumber: 1
zpe: 714778.6 jmol-1
zpe.correction: 0.272245 hartree
zpe.thermalcorrener: 0.293325 hartree
zpe.thermalcorrenthalpy: 0.294269 hartree
zpe.thermalcorrgfe: 0.220429 hartree
zpe.sumelectzpe: -1196.299544 hartree
zpe.sumelectthermal: -1196.278464 hartree
zpe.sumelectthermalent: -1196.277519 hartree
zpe.sumelectthermalfe: -1196.351360 hartree
dipole: -1.5228 -2.6656 -0.8329
dipole: 3.1809
quadrupole: -131.6303 -126.2533 -136.4468
quadrupole: -26.8460 -7.3097 -4.8385
quadrupole: -0.1868 5.1902 -5.0034 -26.8460 -7.3097 -4.8385
hfenergy: -1196.5717885 hartree
pointgroup: C01 [X(C15H16Br1N1O2S1)]
dipole: -0.2293344 1.1758294 0.3619685 debye
polarizability: 306.2931486|-9.1522429|255.8562504|20.9486431|-6.7995688|148.0925567 unknown
InChI: InChI=1S/C15H16BrNO2S/c1-10-9-11(2)15(12(3)14(10)16)17-20(18,19)13-7-5-4-6-8-13/h4-9,17H,1-3H3
charge 0 multiplicity 1
36 atoms
Br -2.745929 3.215284 0.341705
S  1.408785 -1.73895 -0.170558
O  2.199817 -3.015112 0.471932
O  0.696221 -1.819999 -1.641157
N  0.046327 -1.269216 1.279794
C  -1.161801 -0.71999 0.767641
C  -1.306655 0.711536 0.805979
C  -2.212848 -1.553147 0.255961
C  -3.590568 0.464112 -0.174671
C  -2.520198 1.25204 0.322488
C  -3.402582 -0.942381 -0.183371
C  2.569959 -0.253593 -0.203974
C  -0.208221 1.579414 1.377648
C  -2.042834 -3.057468 0.174269
C  -4.883931 1.060421 -0.683907
C  3.549594 -0.158355 0.797697
C  2.418933 0.670069 -1.250259
C  4.426276 0.950288 0.748131
C  3.306521 1.770876 -1.28105
C  4.300371 1.911239 -0.283685
H  -0.075434 -2.248675 1.612464
H  -4.213543 -1.570481 -0.569302
H  0.246306 2.217451 0.596747
H  -0.610811 2.261463 2.148153
H  0.575632 0.950463 1.823311
H  -1.855627 -3.516943 1.165052
H  -2.948255 -3.531918 -0.23823
H  -1.19377 -3.321217 -0.48366
H  -5.384936 1.660692 0.098097
H  -4.702736 1.744055 -1.534073
H  -5.578394 0.27098 -1.015227
H  3.63503 -0.928302 1.570862
H  1.651245 0.518412 -2.016134
H  5.204682 1.059056 1.510437
H  3.222458 2.511048 -2.083513
H  4.983613 2.766851 -0.3146
