program: Gaussian 09
title: 000290213
version: EM64L-G09RevD.01
frameworkgroup: C1[X(C7H10N2O2)]
method: RPBEPBE
basis: SDD
operation: Freq
keyword: #p
keyword: freq=noraman
keyword: PBEPBE/SDD
title: #p freq=noraman PBEPBE/SDD
converged: YES YES NO NO
title: Mulliken charges:
elementType: O O N N C C C C C C C H H H H H H H H H H
charge: -0.277878 -0.359154 -0.646787 -0.646912 0.216912 -0.061263 0.215339 0.230511 -0.840415 -0.795057 0.161686 0.230165 0.231150 0.244505 0.236140 0.235838 0.252559 0.318213 0.390581 0.334673 0.329193
chargesum: 0.00000
title: Mulliken charges with hydrogens summed into heavy atoms:
elementType: O O N N C C C C C C C
charge: -0.277878 -0.359154 0.062007 0.016954 0.216912 -0.061263 0.215339 0.230511 -0.134594 -0.070521 0.161686
polarizability: 1.25738211e+02 1.84966087e+00 1.16680474e+02 -3.89576767e-02 8.78883089e-03 5.09839489e+01
1716.lowfreq: -113.3987 -15.2401 -12.6558 -4.1105 -0.0005 -0.0004 0.0004 79.4870 111.2247
frequency: -113.3857 79.4701 111.2244 179.0353 188.3909 193.7177 247.1864 251.2695 281.6514 326.8244 357.8433 362.3520 407.5271 454.4373 533.4020 544.4263 579.9061 603.9860 614.0561 655.5887 678.1616 720.5924 768.3397 825.1090 909.7170 983.7755 1031.2530 1039.9224 1044.3381 1065.3550 1120.2515 1134.5810 1228.7066 1359.3977 1374.5114 1399.8796 1405.5940 1434.4159 1464.1979 1470.3990 1480.9593 1482.7278 1508.2687 1570.3381 1610.1284 1646.8504 1660.1915 2958.3772 2974.1187 3028.9872 3045.3111 3081.0308 3094.8081 3350.4998 3538.8548 3665.2690 3695.9002
redmass: 1.0232 3.6791 4.2078 3.2252 1.1350 3.8704 2.5418 4.1389 2.8920 4.5676 3.3899 1.2000 7.9790 1.1855 1.1921 3.2135 4.4515 4.3681 4.2730 7.2541 4.6768 1.5291 2.7652 3.7367 1.9732 2.6048 1.3573 1.8039 1.4752 2.2951 2.9751 2.3530 4.4796 4.7525 3.1677 1.4669 1.2926 2.6572 1.0446 1.0687 1.0496 1.0826 2.4240 2.0805 1.3887 7.7984 7.3627 1.0390 1.0381 1.0986 1.0989 1.0950 1.0961 1.0581 1.0444 1.0921 1.1043
irintensity: 0.0219 7.5340 0.0954 14.6642 0.0776 6.5472 0.7488 6.9395 12.4399 15.6125 6.2415 148.1284 2.1455 174.1107 94.7443 4.5157 5.2526 0.1209 5.9674 18.1057 13.7807 58.6111 95.7709 0.6413 4.1643 17.6696 6.1843 8.8136 0.1520 23.4643 19.8285 32.4485 38.9461 5.3246 21.9340 39.0541 9.6999 121.0419 24.8862 8.8138 10.1022 56.7421 238.1524 208.7306 78.4856 199.4615 414.9839 38.3232 46.8606 23.8490 20.2328 21.8588 9.9502 125.2692 39.8091 94.2820 39.6634
temp: 298.150 k
press: 1.00000 atm
elementType: 8 8 7 7 6 6 6 6 6 6 6 1 1 1 1 1 1 1 1 1 1
symmnumber: 1
zpe: 435580.7 jmol-1
zpe.correction: 0.165904 hartree
zpe.thermalcorrener: 0.176782 hartree
zpe.thermalcorrenthalpy: 0.177727 hartree
zpe.thermalcorrgfe: 0.130134 hartree
zpe.sumelectzpe: -531.887690 hartree
zpe.sumelectthermal: -531.876811 hartree
zpe.sumelectthermalent: -531.875867 hartree
zpe.sumelectthermalfe: -531.923459 hartree
dipole: -2.3035 2.0989 0.0266
dipole: 3.1164
quadrupole: -66.1663 -49.2469 -68.3083
quadrupole: 3.1212 0.0381 -0.0428
quadrupole: -4.9258 11.9937 -7.0678 3.1212 0.0381 -0.0428
hfenergy: -532.0535936 hartree
pointgroup: C01 [X(C7H10N2O2)]
dipole: 0.825884 -0.9061655 0.0078691 debye
dipolederiv: -0.7821765 0.1869481 0.0009394 0.0200443 -0.5906803 -0.0013761 0.0009252 -0.0011116 -0.146522 -1.0824555 0.1917708 -0.0008596 0.319359 -0.8312772 0.0001629 -0.0000106 0.0000609 -0.4056134 -0.4698495 0.4742816 0.0020383 0.2477999 -1.3766529 -0.0010673 0.000934 0.0059471 -0.6663134 -0.5395037 -0.4206015 0.0016401 -0.5220867 -1.1158085 -0.0024201 0.0009694 -0.0025322 -0.687801 0.3375178 -0.1061402 -0.0008472 -0.1540886 0.1336937 0.0004336 -0.0013168 0.0017521 -0.0653377 -0.954129 -0.4899069 -0.0016943 -0.118949 -0.718973 -0.0010813 -0.0016982 -0.0019621 -0.1457612 0.1445006 0.0052494 -0.0003413 -0.310421 0.375418 0.0015971 0.0062201 0.0018798 -0.0761308 0.681763 -0.3923805 -0.0025445 0.0527323 1.585127 0.0038781 -0.0024678 0.0000969 0.1837872 0.0157289 0.0470354 -0.0001709 0.0632843 -0.0076837 -0.0006441 -0.0005879 -0.0010832 0.1085448 -0.0258774 -0.013124 0.0021502 0.0235399 0.0103728 -0.0003921 -0.0025215 -0.0006221 0.1066901 1.8021135 0.4546081 0.0029304 0.3140392 1.5417701 0.0014831 0.002448 0.0007118 0.2453188 0.0447481 -0.0945192 0.1045514 -0.0486396 -0.0054798 0.045999 0.1022621 0.0862247 -0.0460993 0.0467967 -0.0927481 -0.103907 -0.0475275 -0.0047716 -0.0457776 -0.1012378 -0.0861043 -0.0473126 -0.1097886 0.1337622 -0.0002856 0.0349516 0.058678 -0.0000667 -0.0002206 -0.0001359 0.1079258 -0.0459282 0.0367464 -0.0279666 0.0955069 0.0451668 0.1023154 -0.1034731 0.0941269 -0.0486547 -0.0405876 0.0366955 0.0257721 0.0967972 0.0403797 -0.1049606 0.0994572 -0.0961184 -0.0441646 0.0586466 -0.0465937 0.0005517 -0.1265526 -0.04742 0.0027289 0.0015338 0.0022919 0.1301576 0.1725355 -0.017266 -0.000493 -0.0356451 0.2603475 -0.001111 -0.000635 -0.0044816 0.4025553 0.3453191 0.0484369 0.0005505 0.016541 0.3292057 -0.0001647 0.0010031 -0.0002607 0.3716254 0.2155082 0.02527 -0.0013602 0.0470298 0.1390271 0.0002905 -0.0008121 0.0013693 0.3477259 0.1851179 0.0324759 -0.0006538 0.0322847 0.1795603 0.0001731 -0.0007715 -0.000049 0.3753797 unknown
polarizability: 126.0016454|0.9824958|116.416508|0.0526168|0.1845601|50.9844809 unknown
InChI: InChI=1S/C7H10N2O2/c1-3-4(2)11-7(9)5(3)6(8)10/h8-9H2,1-2H3
charge 0 multiplicity 1
21 atoms
O  1.441599 1.273739 0.003367
O  -2.727932 0.742962 -0.001102
N  -0.61674 2.467564 0.009532
N  -2.390352 -1.547334 -0.002936
C  0.716461 -0.91647 -0.001217
C  -0.455227 -0.030235 0.002849
C  1.842161 -0.118877 -0.000664
C  0.051886 1.282564 0.007099
C  0.732498 -2.424751 -0.006225
C  3.320261 -0.355792 -0.00022
C  -1.899089 -0.248534 -0.000953
H  0.231191 -2.845096 0.888277
H  0.235399 -2.838338 -0.905874
H  1.766754 -2.808217 -0.003828
H  3.655489 -0.906822 0.898628
H  3.651376 -0.927808 -0.887254
H  3.846948 0.613016 -0.01282
H  -0.131526 3.359744 0.017086
H  -1.643487 2.359802 0.011423
H  -1.786879 -2.364934 0.001055
H  -3.401691 -1.665782 -0.006826
