program: Gaussian 09
title: 000290212
version: EM64L-G09RevD.01
frameworkgroup: C1[X(C8H7ClN2S)]
method: RPBEPBE
basis: SDD
operation: Freq
keyword: #p
keyword: freq=noraman
keyword: PBEPBE/SDD
title: #p freq=noraman PBEPBE/SDD
converged: NO NO NO NO
title: Mulliken charges:
elementType: Cl S N N C C C C C C C C H H H H H H H
charge: -0.009986 0.314481 0.053773 0.073391 0.438733 0.448872 -0.276484 -0.431451 -0.801660 -0.763657 -0.392458 -0.382299 0.250538 0.250532 0.235140 0.239471 0.246863 0.246831 0.259371
chargesum: 0.00000
title: Mulliken charges with hydrogens summed into heavy atoms:
elementType: Cl S N N C C C C C C C C
charge: -0.009986 0.314481 0.053773 0.073391 0.438733 0.448872 -0.276484 -0.431451 -0.065450 -0.030493 -0.392458 -0.122927
polarizability: 1.71111190e+02 -5.78206820e+00 1.47560227e+02 -1.49008459e-03 -2.24907777e-04 5.63575246e+01
1716.lowfreq: -5.9363 0.0015 0.0017 0.0028 10.1750 11.6602 57.9594 71.5166 120.9462
frequency: 57.8374 71.5105 120.9357 146.8722 183.7126 210.1459 230.8633 282.3944 292.4042 326.6397 370.4067 416.5479 475.3757 502.5252 504.8136 526.3841 571.0895 621.7336 667.4588 767.0579 770.9116 782.1675 909.3304 914.8500 1020.1552 1025.8327 1043.0810 1091.4884 1125.1163 1159.5803 1190.4109 1232.8955 1276.9801 1361.5681 1397.4902 1401.0367 1410.1432 1442.3978 1458.0233 1458.7114 1476.1196 1478.6444 1517.8777 1575.3296 2981.1493 2993.6444 3060.9353 3076.1954 3092.9490 3100.4091 3188.7425
redmass: 2.0182 1.5553 3.6962 1.0214 7.6654 6.0660 7.1212 4.9041 2.7226 4.1303 11.6229 9.7823 6.5704 4.2131 9.6802 6.5028 11.7190 4.4267 4.4799 5.5833 8.5479 11.5014 1.4368 2.5732 1.3703 2.3625 1.5098 1.9512 5.4057 5.3377 4.8914 4.5924 10.6022 3.0514 1.6509 1.4221 1.2744 6.3661 1.1392 1.0444 1.1208 1.0439 6.4286 6.4374 1.0376 1.0367 1.0983 1.0981 1.0982 1.0986 1.0931
irintensity: 0.9038 0.0009 0.4502 0.5946 1.1864 0.5853 0.8158 0.0386 0.4780 1.1661 12.1958 0.1910 0.1367 9.8385 1.0038 0.6406 0.0432 3.8937 22.2837 15.4817 0.2075 71.3890 11.5408 4.8718 4.7955 22.1956 0.4182 10.8229 64.8520 2.9107 18.2976 13.6572 14.1657 156.1070 23.0086 33.5605 18.1260 134.1651 2.6546 29.8414 34.4740 0.0486 5.3774 40.6306 16.4686 18.3746 12.9402 10.1505 10.9277 13.8523 8.6569
temp: 298.150 k
press: 1.00000 atm
elementType: 17 16 7 7 6 6 6 6 6 6 6 6 1 1 1 1 1 1 1
symmnumber: 1
zpe: 349075.6 jmol-1
zpe.correction: 0.132956 hartree
zpe.thermalcorrener: 0.144264 hartree
zpe.thermalcorrenthalpy: 0.145208 hartree
zpe.thermalcorrgfe: 0.095017 hartree
zpe.sumelectzpe: -1275.814258 hartree
zpe.sumelectthermal: -1275.802950 hartree
zpe.sumelectthermalent: -1275.802005 hartree
zpe.sumelectthermalfe: -1275.852197 hartree
dipole: -3.6013 2.3924 0.0001
dipole: 4.3236
quadrupole: -83.6911 -83.7250 -84.9257
quadrupole: -7.2352 -0.0002 0.0004
quadrupole: 0.4228 0.3889 -0.8117 -7.2352 -0.0002 0.0004
hfenergy: -1275.9472138 hartree
pointgroup: C01 [X(C8H7Cl1N2S1)]
dipole: -1.676671 -0.2867991 -0.0000025 debye
dipolederiv: -0.1362891 0.0642652 0.0000182 0.1682734 -0.9492612 -0.0001856 0.0000308 -0.0001796 -0.0790563 -0.3830937 -0.0224867 0.0000681 0.0951669 -0.1665357 -0.0000769 0.0000633 -0.000047 0.1027201 -0.6255026 -0.0102433 0.0000503 -0.0115235 -0.4796474 -0.0000617 0.0000277 -0.0000832 -0.1531501 -0.5763424 -0.4216992 -0.0000523 0.0041942 -0.8248127 -0.000157 0.0000214 -0.0001039 -0.1390685 -0.4732279 0.0933748 0.0000509 0.1991099 0.0977953 0.0000375 0.0000524 0.000023 -0.0413424 0.1551383 0.1164211 0.000032 0.5576852 -0.7666448 -0.0002449 0.0001288 -0.0001966 0.1058574 0.4432791 0.1827253 0.0000257 -0.0410114 0.3755469 0.0001158 0.000183 0.0000045 -0.1565516 0.6651329 -0.0677184 -0.0001195 -0.5527189 0.3462897 0.0001405 -0.000196 0.0000971 -0.0500933 0.0374524 0.0320419 0.0000397 -0.0193387 -0.1144855 -0.0000648 0.0000262 -0.0000775 0.0669107 -0.1798705 -0.0060558 0.0000332 -0.1554603 0.0274392 -0.0000033 -0.0003425 0.0000544 0.0736456 0.5009299 0.0395739 -0.0000272 -0.2060949 1.6216475 0.0003248 -0.0000724 0.0003115 0.0372682 0.4823671 0.0722979 -0.0000281 -0.0264759 0.6436578 0.0001604 -0.0000027 0.0001547 -0.0419199 0.0990989 0.0366563 0.0747794 -0.0082362 0.0006648 -0.053156 0.0446338 -0.0727716 -0.0224126 0.0991318 0.0366254 -0.0747165 -0.0082452 0.0005664 0.0531918 -0.044598 0.0728353 -0.0224304 -0.1468281 -0.0746836 -0.0000747 0.0243588 0.1021947 0.0000131 -0.0000247 0.0000212 0.1042208 0.0775189 0.0200277 0.0000482 0.1247276 -0.0719613 -0.0002912 0.0002027 -0.0002375 0.1239496 -0.0110686 -0.0134699 -0.0285337 -0.0471582 0.0574381 -0.0982169 -0.0719951 -0.0720237 -0.0224167 -0.0109069 -0.0135618 0.0284085 -0.0473514 0.0569655 0.098491 0.0718852 0.0722431 -0.021987 -0.0169195 -0.0640908 -0.0000024 -0.0499013 0.0431426 -0.0000165 -0.0000238 -0.0000242 0.1358563 unknown
polarizability: 171.5305383|-4.8353266|147.1408739|-0.0080245|0.0198962|56.3575294 unknown
InChI: InChI=1S/C8H7ClN2S/c1-4-5(2)12-8-6(4)7(9)10-3-11-8/h3H,1-2H3
charge 0 multiplicity 1
19 atoms
Cl 1.596114 -2.672216 -0.000816
S  -1.349593 1.994328 0.000432
N  1.425598 1.935616 0.000153
N  2.609737 -0.181199 -0.000399
C  -1.202205 -0.701516 -0.000236
C  0.17187 -0.218262 -0.000226
C  -2.121853 0.340139 0.000105
C  0.276156 1.222059 0.000084
C  -1.625344 -2.154934 -0.000597
C  -3.627081 0.257408 0.000163
C  1.448619 -0.849085 -0.000451
C  2.561253 1.187852 -0.00012
H  -1.237043 -2.686033 -0.887528
H  -1.237427 -2.686377 0.886303
H  -2.724224 -2.243418 -0.000866
H  -4.090879 1.257734 0.001562
H  -3.995451 -0.28106 -0.892884
H  -3.995226 -0.28344 0.891851
H  3.516982 1.716505 -0.000031
