program: Gaussian 09
title: 000292784
version: EM64L-G09RevD.01
frameworkgroup: C1[X(C13H9NO2S)]
method: RPBEPBE
basis: SDD
operation: Freq
keyword: #p
keyword: freq=noraman
keyword: PBEPBE/SDD
title: #p freq=noraman PBEPBE/SDD
converged: NO YES NO NO
title: Mulliken charges:
elementType: S O O N C C C C C C C C C C C C C H H H H H H H H H
charge: 0.223540 -0.448595 -0.260367 -0.502731 0.604780 -0.331156 0.571350 -0.319874 -0.407487 -0.432322 0.272776 -0.411542 -0.327759 -0.274793 -0.214157 -0.250857 0.101187 0.306085 0.228190 0.280868 0.225139 0.276777 0.241716 0.232341 0.234794 0.382097
chargesum: 0.00000
title: Mulliken charges with hydrogens summed into heavy atoms:
elementType: S O O N C C C C C C C C C C C C C
charge: 0.223540 -0.066497 -0.260367 -0.196646 0.604780 -0.331156 0.571350 -0.319874 -0.179298 -0.151454 0.272776 -0.186403 -0.050982 -0.033078 0.018184 -0.016063 0.101187
polarizability: 3.48395894e+02 -3.78770052e+00 1.71524688e+02 -2.18248089e-02 -3.89218783e-03 6.28070999e+01
1716.lowfreq: -21.7753 -2.4481 -0.0002 0.0009 0.0010 4.6820 11.6568 65.3504 85.1299
frequency: -21.6976 65.3470 85.1293 120.8471 142.3950 167.2327 230.0545 253.3062 261.3924 302.4423 363.9821 407.6674 425.1380 439.1956 441.7516 458.7606 509.4545 516.8723 525.8598 574.7454 586.9448 595.2029 633.6699 660.0286 670.9000 700.1646 714.3601 748.2462 753.4492 757.2789 830.7392 843.1030 849.3738 885.1777 926.6165 928.2098 966.1492 968.4642 1018.0122 1030.0088 1048.8341 1059.1323 1127.0623 1151.2185 1159.0396 1173.4254 1240.2092 1245.5109 1278.0211 1296.4407 1324.9706 1363.2378 1385.4525 1417.1944 1428.0347 1483.9852 1495.8718 1512.3642 1577.3661 1586.9272 1601.5711 1622.1603 1638.3701 3114.7624 3120.3892 3135.1637 3148.0992 3150.3205 3172.4851 3182.5901 3533.5025 3549.3544
redmass: 8.4463 9.6217 5.2160 7.7731 4.7603 5.5948 6.6838 4.3696 8.0598 4.9457 6.2481 10.8129 11.1586 3.1116 3.0096 7.6472 6.7234 2.2201 2.8715 1.4482 5.1983 1.4562 5.8470 6.8223 7.0351 4.4476 3.0666 2.2623 1.8512 6.5152 1.5556 6.1507 1.4308 5.8805 1.4138 1.4206 1.3685 1.3200 4.6943 4.4650 2.2004 3.0702 1.6137 1.2704 1.9270 1.0601 1.3669 2.8627 1.4290 1.8946 2.4663 3.6545 8.1161 3.3037 3.5006 3.0198 2.2938 3.4931 4.6088 6.5077 4.4804 7.2531 8.1884 1.0890 1.0903 1.0881 1.0921 1.0924 1.1005 1.0947 1.0641 1.0759
irintensity: 0.0116 0.7910 0.0996 0.8225 0.8685 0.8550 0.0728 2.7661 1.2791 0.1810 1.4111 6.2422 5.1823 6.4848 14.0327 14.8876 7.3396 80.7085 0.5907 5.7752 35.5719 102.6437 20.5914 10.9123 10.3482 46.4699 16.6693 6.3487 113.7126 17.9563 48.6742 10.7300 3.8772 1.8560 16.9851 2.3393 0.1392 0.0703 298.3301 96.8942 12.9403 9.5982 13.0579 63.4914 246.0886 0.9186 2.9375 2.8290 27.5862 2.3034 168.6666 313.1949 9.7797 0.8750 23.4265 256.0023 59.3345 338.2558 172.3803 47.9411 10.2076 105.5007 329.8903 11.1660 14.5794 0.5626 2.5798 14.8973 26.2512 1.3203 64.7169 29.3611
temp: 298.150 k
press: 1.00000 atm
elementType: 16 8 8 7 6 6 6 6 6 6 6 6 6 6 6 6 6 1 1 1 1 1 1 1 1 1
symmnumber: 1
zpe: 494540.6 jmol-1
zpe.correction: 0.188361 hartree
zpe.thermalcorrener: 0.201151 hartree
zpe.thermalcorrenthalpy: 0.202095 hartree
zpe.thermalcorrgfe: 0.149110 hartree
zpe.sumelectzpe: -1102.899641 hartree
zpe.sumelectthermal: -1102.886851 hartree
zpe.sumelectthermalent: -1102.885907 hartree
zpe.sumelectthermalfe: -1102.938892 hartree
dipole: -2.9100 4.0833 0.0007
dipole: 5.0141
quadrupole: -92.6144 -96.5702 -111.5182
quadrupole: 5.4202 -0.0053 -0.0029
quadrupole: 7.6199 3.6640 -11.2839 5.4202 -0.0053 -0.0029
hfenergy: -1103.0880018 hartree
pointgroup: C01 [X(C13H9N1O2S1)]
dipole: 1.1624746 -1.5937976 0.0007913 debye
dipolederiv: -0.5243352 -0.0555953 -0.000152 -0.0988457 -0.0540922 -0.0001 -0.0001408 0.0002303 -0.0017201 -1.3684347 -0.4448645 0.0003024 -0.798333 -0.6248683 0.0002961 0.0009877 0.0004323 -0.4307838 -1.0737469 0.2797461 0.0000917 0.6317488 -0.9945925 0.0002047 0.0005593 -0.0002529 -0.3373343 -2.2498302 -0.0918713 -0.000259 0.0251326 -0.2330558 -0.0002455 0.0001647 -0.0005925 -0.3252807 1.8144418 -0.2977885 0.0000165 -0.820123 0.0169022 0.0000626 0.0000758 0.0002999 0.1425696 0.149602 0.4405523 -0.0005558 1.1639231 0.0324343 -0.0000878 -0.0002641 -0.0002757 -0.0888299 1.1394612 0.4525841 0.0003131 1.0484625 0.1348297 0.0004967 0.0000457 0.0005007 0.1205045 0.5008621 -0.2356619 0.0008935 -0.7337557 -0.0945884 -0.000314 0.0005489 -0.0003015 -0.0767773 -0.7568255 0.1361541 -0.0001124 -0.3427985 0.1060357 -0.0000365 -0.000037 -0.0000703 -0.2149804 0.343522 -0.1609232 -0.000049 0.0188859 0.0040074 -0.0000531 -0.0001251 0.0000159 -0.0757115 -1.383791 0.2057204 0.0002391 0.3808589 -0.2036287 -0.000012 0.0002642 -0.000052 -0.0272565 -0.2950928 -0.1976169 0.0001666 0.0763384 0.0785711 0.0000454 -0.0000933 -0.0001784 -0.2041077 0.3867742 -0.1314345 0.0000022 -0.3442458 0.1420827 -0.0000278 -0.0002244 -0.0000082 -0.1046675 -0.1173516 0.0080144 0.0000117 0.1316293 0.1064771 0.0000391 -0.0000553 -0.0000541 -0.1092975 0.0447265 0.0507182 0.0001011 -0.1262336 0.0989026 -0.0001364 0.0003064 0. -0.1506558 -0.1413951 0.0531428 0.0001247 0.0474465 -0.0783565 0.0000778 0.0001587 0.0000402 -0.1867369 2.847205 -0.1146501 -0.0007175 -0.3468034 1.3381349 -0.0003735 -0.0017227 -0.0001652 0.2238672 0.1149679 -0.0012384 -0.0000537 -0.0600235 0.1412771 0.0000236 -0.0000725 0.0001544 0.3082626 0.0351693 0.0862619 0.0000291 0.0413853 -0.0939365 0.0000498 -0.0000033 0.0000626 0.1667373 0.1523542 0.0036364 0.0000289 -0.0178133 0.0152422 0.0000171 0.0000638 0.0000634 0.1533083 0.080506 -0.0501175 -0.0000863 -0.0000884 -0.1191343 0.0000467 -0.0000463 0.0000332 0.1688019 0.0586647 -0.0719602 0.0000273 -0.0738534 0.0531318 0.0000358 0.0000764 0.0000321 0.1614692 0.1096287 0.0462595 -0.0000708 -0.0093608 -0.0619628 0.0000018 -0.0000772 0.0000838 0.1549313 -0.0921498 0.0852796 -0.0001966 0.1054306 0.0419791 0.0000919 -0.0002386 0.0000824 0.1639832 -0.0868109 -0.0818069 -0.0001934 -0.0936874 0.0364799 -0.0000559 -0.0002126 -0.0000649 0.1717876 0.3118781 0.0874596 0.0000985 0.1947237 0.2117285 -0.0000467 0.0000618 -0.0000155 0.3979174 unknown
polarizability: 348.4577779|-1.843013|171.4627933|0.0390744|-0.0276699|62.8071104 unknown
InChI: InChI=1S/C13H9NO2S/c15-13(16)8-5-6-10-12(7-8)17-11-4-2-1-3-9(11)14-10/h1-7,14-15H
charge 0 multiplicity 1
26 atoms
S  0.790295 1.820492 -0.002573
O  -5.229918 -0.582711 0.001095
O  -4.635814 1.665981 0.000379
N  1.146593 -1.355162 -0.0011
C  -0.172225 -0.887647 -0.000897
C  -0.493811 0.503087 -0.001147
C  2.339138 -0.596387 -0.000228
C  2.335636 0.824299 -0.000442
C  -1.235439 -1.833506 -0.000394
C  -1.833801 0.912565 -0.000752
C  -2.889662 -0.040025 -0.000299
C  3.582158 -1.278671 0.000944
C  -2.577031 -1.422123 -0.000143
C  3.554698 1.531498 0.000596
C  4.800699 -0.567508 0.00185
C  4.790891 0.844114 0.001707
C  -4.279548 0.459708 0.0000
H  1.264065 -2.369352 -0.001025
H  -0.991354 -2.90306 -0.000187
H  -2.096237 1.976261 -0.000874
H  3.587576 -2.376169 0.001144
H  -3.386583 -2.156168 0.000196
H  3.539673 2.627237 0.000477
H  5.748251 -1.115816 0.002708
H  5.72786 1.409504 0.002443
H  -6.13631 -0.173841 0.001722
