program: Gaussian 09
title: 000292785
version: EM64L-G09RevD.01
frameworkgroup: C1[X(C13H15NO4)]
method: RPBEPBE
basis: SDD
operation: Freq
keyword: #p
keyword: freq=noraman
keyword: PBEPBE/SDD
title: #p freq=noraman PBEPBE/SDD
converged: YES YES NO NO
title: Mulliken charges:
elementType: O O O O N C C C C C C C C C C C C C H H H H H H H H H H H H H H H
charge: -0.432061 -0.303909 -0.218745 -0.217206 -0.151882 -0.443829 -0.110034 -0.507068 -0.511081 0.198043 0.176849 -0.309509 0.392773 -0.345929 -0.386343 -0.221729 -0.196587 -0.254818 0.283093 0.243222 0.259123 0.267685 0.263174 0.263209 0.265024 0.207804 0.243664 0.362281 0.248301 0.252134 0.225280 0.229435 0.229637
chargesum: 0.00000
title: Mulliken charges with hydrogens summed into heavy atoms:
elementType: O O O O N C C C C C C C C C C C C C
charge: -0.069781 -0.303909 -0.218745 -0.217206 -0.151882 0.082486 0.149089 0.023791 0.017152 0.198043 0.176849 0.141959 0.392773 -0.097628 -0.134208 0.003551 0.032848 -0.025181
polarizability: 2.10304033e+02 6.70726247e+00 1.62248254e+02 -8.40826883e+00 -1.35971741e+00 9.12492980e+01
1716.lowfreq: -8.0508 -0.0010 -0.0006 -0.0006 3.1908 5.1010 19.2246 25.7470 32.5851
frequency: 19.2009 25.7395 32.5581 62.1470 73.9864 85.1355 105.6688 111.6918 137.7739 165.1486 232.9462 263.7321 310.7092 318.6434 387.5423 392.9327 408.6141 412.4658 485.7355 502.2606 509.5901 541.5171 543.1599 577.0002 603.6071 610.2453 649.6572 657.4490 691.4033 739.8935 758.4244 800.9151 823.4699 823.5818 842.1586 890.5463 899.9325 918.6368 959.0034 962.8790 984.1269 984.2080 1011.4639 1011.6053 1022.3638 1035.4540 1071.3879 1078.1606 1083.8972 1105.6544 1143.9853 1155.4704 1168.2784 1178.0328 1209.0281 1217.0338 1219.5400 1253.9833 1270.4470 1292.1389 1300.9302 1315.0486 1340.5926 1357.1457 1363.6537 1375.1474 1389.2748 1392.9694 1438.8883 1443.6243 1445.6972 1454.8548 1459.1826 1481.1665 1593.8540 1611.9282 1629.6743 1695.3606 2964.9685 3026.1308 3027.7457 3037.2437 3037.4099 3059.2118 3080.3504 3097.9091 3099.8207 3129.6737 3138.4232 3155.3341 3163.1207 3173.0455 3541.3426
redmass: 5.0665 5.6872 5.1085 4.6615 4.4222 1.9546 5.1903 5.9503 6.0291 4.8930 4.8821 4.1098 4.9209 2.8594 2.9496 2.6342 1.7338 2.8481 2.8107 2.9000 4.6843 3.9097 3.6379 3.4721 4.5905 6.3422 5.5617 6.0486 2.1008 4.8945 1.6245 4.7798 1.5774 1.2722 3.2101 1.4670 2.6520 2.0735 4.1680 1.3692 5.6469 1.3142 2.3022 2.2451 2.0708 2.4143 3.3573 3.6756 1.6029 2.2043 1.2250 2.1377 1.0858 1.1680 1.1123 2.9125 1.2831 1.6293 1.7037 1.5151 1.5544 1.3479 1.5089 2.1473 1.7529 1.3740 6.2110 1.3536 1.0760 2.2751 1.1000 1.1003 1.1595 2.0489 6.4543 6.2770 12.0579 11.4473 1.0570 1.0599 1.0594 1.0635 1.1050 1.0871 1.1032 1.1016 1.1037 1.0848 1.0889 1.0923 1.0957 1.1010 1.0654
irintensity: 0.8982 0.3329 0.7145 0.7621 4.0430 0.8664 9.2787 2.2149 9.5020 2.2170 1.1818 5.8216 9.3569 12.5111 4.6991 125.5885 128.4473 2.1795 59.6403 10.0008 2.3695 1.1141 0.2265 12.6211 4.1404 0.3144 6.6143 31.4447 32.1215 2.6053 92.7475 13.5894 7.2022 2.1371 23.4589 5.1606 52.6845 17.1702 47.3219 0.0997 2.0743 0.6861 12.0965 6.5139 14.1717 17.4983 36.4504 29.6115 23.8710 32.2979 1.2741 114.0425 10.2760 41.5601 0.0855 232.2385 23.2249 23.5742 77.1500 0.3928 8.9044 0.7255 55.9480 74.3357 28.8637 54.9490 9.3736 104.8575 0.7675 3.6887 35.3407 14.7414 62.7577 72.7039 26.1356 79.1159 546.7392 11.8766 32.5561 10.5236 13.0727 2.6813 30.1308 13.4532 0.0251 8.1915 1.8109 3.0490 10.2784 30.8120 19.6592 6.5096 12.6455
temp: 298.150 k
press: 1.00000 atm
elementType: 8 8 8 8 7 6 6 6 6 6 6 6 6 6 6 6 6 6 1 1 1 1 1 1 1 1 1 1 1 1 1 1 1
symmnumber: 1
zpe: 685787.3 jmol-1
zpe.correction: 0.261203 hartree
zpe.thermalcorrener: 0.278050 hartree
zpe.thermalcorrenthalpy: 0.278994 hartree
zpe.thermalcorrgfe: 0.213575 hartree
zpe.sumelectzpe: -858.710925 hartree
zpe.sumelectthermal: -858.694078 hartree
zpe.sumelectthermalent: -858.693134 hartree
zpe.sumelectthermalfe: -858.758552 hartree
dipole: -0.3681 -0.4331 -0.7204
dipole: 0.9176
quadrupole: -81.6569 -110.3540 -111.0405
quadrupole: -9.2863 -0.8662 -4.2210
quadrupole: 19.3602 -9.3369 -10.0234 -9.2863 -0.8662 -4.2210
hfenergy: -858.9721277 hartree
pointgroup: C01 [X(C13H15N1O4)]
dipole: -0.1408249 -0.2235967 -0.2459845 debye
polarizability: 210.0583273|5.9793712|159.4372457|-9.4183378|-14.6032668|94.3060111 unknown
InChI: InChI=1S/C13H15NO4/c15-10(8-14-12(16)6-7-13(14)17)9-18-11-4-2-1-3-5-11/h1-5,10,15H,6-9H2
charge 0 multiplicity 1
33 atoms
O  -0.880187 0.281624 1.752258
O  1.473304 0.054553 0.092316
O  -2.379807 2.196973 -0.377733
O  -3.554719 -2.336576 -0.390528
N  -2.687678 -0.144361 -0.44344
C  -1.274743 -0.51102 -0.574109
C  -0.646781 -0.815859 0.811742
C  -4.650979 1.166883 -0.134791
C  -5.041838 -0.331283 -0.138815
C  -3.130542 1.194528 -0.321149
C  -3.72748 -1.094785 -0.33264
C  0.848482 -1.136538 0.690189
C  2.873914 0.071993 -0.050326
C  3.721046 -1.007776 0.298997
C  3.413412 1.266933 -0.58631
C  5.11687 -0.877737 0.106442
C  4.805355 1.379311 -0.771764
C  5.66667 0.308245 -0.426467
H  -0.745678 0.334218 -1.046565
H  -1.206736 -1.403573 -1.221098
H  -1.156848 -1.683758 1.264665
H  -4.900784 1.677392 0.810725
H  -5.123412 1.743389 -0.948444
H  -5.738222 -0.599128 -0.951666
H  -5.506325 -0.66019 0.806448
H  1.017507 -2.025744 0.048099
H  1.267111 -1.31916 1.698799
H  -0.451844 1.099331 1.385969
H  3.317333 -1.936653 0.712507
H  2.733016 2.083973 -0.846233
H  5.772779 -1.712836 0.377119
H  5.219349 2.305404 -1.185671
H  6.748053 0.399827 -0.571331
