program: Gaussian 09
title: 000292770
version: EM64L-G09RevD.01
frameworkgroup: C1[X(C6H9N3O2)]
method: RPBEPBE
basis: SDD
operation: Freq
keyword: #pfreq=noraman
keyword: PBEPBE/SDD
title: #p freq=noraman PBEPBE/SDD
converged: NO YES NO NO
title: Mulliken charges:
elementType: O O N N N C C C C C C H H H H H H H H H
charge: -0.370044 -0.251318 -0.419486 -0.087468 -0.626840 0.311928 -0.507070 -0.025190 -0.004545 -0.641873 0.154316 0.218977 0.225319 0.326292 0.223573 0.225386 0.224570 0.352355 0.344660 0.326458
chargesum: 0.00000
title: Mulliken charges with hydrogens summed into heavy atoms:
elementType: O O N N N C C C C C C
charge: -0.017689 -0.251318 -0.093194 -0.087468 0.044278 0.311928 -0.062773 -0.025190 -0.004545 0.031655 0.154316
polarizability: 1.27868946e+02 -1.16644630e+00 9.63856389e+01 4.99591797e+00 -6.98054794e-01 5.17379342e+01
1716.lowfreq: -11.2656 -5.7886 -0.0008 -0.0006 0.0002 12.4683 14.0726 61.7245 78.0030
frequency: 9.8619 61.7163 77.9745 150.3003 176.1138 190.6764 240.2302 263.2174 304.4597 341.8246 372.9164 424.0642 523.6984 536.1659 573.9953 591.0674 607.5468 659.2118 680.0345 684.7914 726.5817 773.9282 775.1488 943.3052 987.3901 1033.5862 1060.1959 1063.2732 1146.1736 1180.9181 1190.4330 1228.0262 1297.5518 1313.7598 1338.6285 1370.2636 1394.4946 1448.6300 1470.2044 1473.0480 1485.3404 1540.0524 1559.1184 1576.3823 1631.4463 2972.4413 2985.4344 3026.3003 3085.7531 3088.6926 3508.6989 3554.5052 3601.5430 3676.4689
redmass: 2.5746 5.9890 4.3683 2.9699 3.5215 1.6717 1.1943 1.8735 6.5067 3.5400 5.9384 5.2943 1.4217 3.5845 1.7373 2.8828 1.0850 2.1697 5.6594 5.6462 4.3302 11.0030 1.3306 3.2755 2.8663 1.5666 1.9859 1.8643 4.5266 1.7327 3.3042 1.6582 1.8826 1.8020 3.0122 2.2004 1.2102 3.4656 1.0981 1.0429 1.0824 4.4742 5.2280 1.4638 5.1024 1.0625 1.0354 1.0986 1.1006 1.1010 1.0447 1.0661 1.0820 1.1045
irintensity: 0.8332 7.1860 0.0479 9.1010 29.4601 6.7754 102.9735 4.2922 0.8957 4.0610 6.8698 4.0516 184.3106 7.8405 5.7663 9.3399 125.7827 88.7581 6.1009 4.3751 9.5737 5.9783 2.3744 46.4777 54.9715 15.6163 2.4651 12.0278 21.0580 107.1443 53.0635 33.3756 6.5949 7.4133 114.5507 9.2396 9.2074 40.4850 7.2847 15.1359 17.6899 2.3681 62.0655 165.6585 308.8837 34.4576 29.8739 12.1451 45.2528 33.2434 34.1786 13.1479 65.0766 49.7122
temp: 298.150 k
press: 1.00000 atm
elementType: 8 8 7 7 7 6 6 6 6 6 6 1 1 1 1 1 1 1 1 1
symmnumber: 1
zpe: 406596.3 jmol-1
zpe.correction: 0.154864 hartree
zpe.thermalcorrener: 0.166278 hartree
zpe.thermalcorrenthalpy: 0.167222 hartree
zpe.thermalcorrgfe: 0.115861 hartree
zpe.sumelectzpe: -547.899567 hartree
zpe.sumelectthermal: -547.888154 hartree
zpe.sumelectthermalent: -547.887210 hartree
zpe.sumelectthermalfe: -547.938571 hartree
dipole: -5.7270 -3.9087 -0.5000
dipole: 6.9517
quadrupole: -52.7355 -63.8072 -66.3444
quadrupole: -10.5559 2.5702 -0.8924
quadrupole: 8.2269 -2.8448 -5.3820 -10.5559 2.5702 -0.8924
hfenergy: -548.0544315 hartree
pointgroup: C01 [X(C6H9N3O2)]
dipole: -2.2698182 1.5085781 0.2289194 debye
dipolederiv: -0.0138586 -0.1348759 -0.0576578 -0.1774341 -1.0685024 0.0604225 -0.0730789 0.0232446 -0.3580698 -0.7431169 0.2281887 0.0363122 0.1140469 -0.9227015 -0.0020094 0.0449953 -0.02207 -0.36792 -0.4040228 0.3113664 0.0265175 0.4312707 -0.2676838 -0.0259173 0.0008279 -0.015797 -0.1910392 -0.1144208 -0.3410329 -0.0422273 -0.5064452 -0.3299022 0.0508055 -0.0037216 0.0398427 -0.1818676 -0.8721047 -0.4768643 0.0144383 -0.4429568 -0.7736639 0.0542866 0.024816 0.0612168 -0.7085959 0.1166179 0.1331021 -0.0186016 -0.23125 0.0862873 0.0186344 0.0079483 -0.0437458 -0.1520124 0.1556287 -0.0433576 0.00042 -0.0017594 0.1151409 -0.0133225 -0.1022015 -0.0100175 0.1680243 -0.1060618 0.113485 0.0157013 0.198312 0.9816202 -0.0649944 0.0312913 -0.0349602 0.0492683 -0.3156534 -0.034735 0.0315072 0.4545879 -0.0697081 -0.0617254 0.0347441 0.0138747 -0.0180523 -0.0303907 -0.0034963 -0.0238175 -0.0121337 0.0649024 -0.0103698 0.0427828 -0.0107669 -0.0043654 1.6675347 0.1772556 -0.1576102 0.1104345 1.3778468 -0.032614 -0.1776812 -0.034216 0.2725953 0.0132279 0.0062791 -0.0273498 -0.0723668 -0.0683526 0.1425595 0.0019001 0.0901985 -0.0139064 -0.0095584 0.0311203 0.0244172 0.0933308 -0.0564127 -0.1294574 0.0312353 -0.0794753 0.0143033 0.1738598 0.0212137 0.0237182 -0.0243246 0.2366824 0.0109509 0.0284018 -0.0048343 0.3101205 0.1074417 -0.0435008 0.007892 0.001645 -0.0673541 0.1244437 -0.0160567 0.0791057 -0.0094228 -0.2301128 -0.0569359 0.0000994 -0.0710694 0.0969422 -0.0027591 0.0009124 0.0050625 0.0643553 0.0682378 0.1012298 0.0472301 0.0658067 -0.0478322 -0.1005671 0.023058 -0.0617627 0.020156 0.0419143 -0.0594841 0.0612156 0.0136205 0.356658 -0.0170777 0.0657332 0.0102663 0.3485485 0.3124214 0.0412393 0.0122096 0.0357508 0.1795237 -0.0009462 0.0084297 -0.0033211 0.3758466 0.1824168 0.0298028 0.0255855 0.0209341 0.1765098 -0.0003429 0.0256639 -0.0018451 0.3820339 unknown
polarizability: 127.7884489|1.6018368|96.4294538|-5.3283326|-0.1313415|51.774616 unknown
InChI: InChI=1S/C6H9N3O2/c1-2-3-5(10)4(6(7)11)9-8-3/h8,10H,2,7H2,1H3
charge 0 multiplicity 1
20 atoms
O  -0.323547 -2.00116 0.199792
O  2.677841 -1.408001 -0.188413
N  -0.833925 1.546533 0.222852
N  0.529759 1.539828 0.044787
N  3.15688 0.876201 -0.275473
C  -1.395374 0.276757 0.31647
C  -2.869646 0.010815 0.45749
C  -0.303388 -0.60826 0.185176
C  0.866154 0.20303 0.021532
C  -3.588775 -0.228924 -0.899753
C  2.292072 -0.200628 -0.154351
H  -3.019067 -0.871832 1.111968
H  -3.353981 0.853858 0.987375
H  -1.318928 2.439557 0.28671
H  -3.505383 0.658445 -1.55198
H  -4.661385 -0.442147 -0.741186
H  -3.142459 -1.081728 -1.441817
H  -1.242159 -2.330322 0.369937
H  2.792929 1.82889 -0.239837
H  4.150681 0.693887 -0.39908
