program: Gaussian 09
title: 000292771
version: EM64L-G09RevD.01
frameworkgroup: C1[X(C8H10BrN3O3)]
method: RPBEPBE
basis: SDD
operation: Freq
keyword: #p
keyword: freq=noraman
keyword: PBEPBE/SDD
title: #p freq=noraman PBEPBE/SDD
converged: YES YES NO NO
title: Mulliken charges:
elementType: Br O O O N N N C C C C C C C C H H H H H H H H H H
charge: 0.111368 -0.273526 -0.217678 -0.178527 -0.122012 -0.031442 0.072435 0.021507 -0.395554 -0.412109 -0.378321 -0.307740 -0.205913 -0.165575 0.185602 0.233997 0.227377 0.236149 0.237019 0.206228 0.212790 0.219836 0.192707 0.235696 0.295685
chargesum: 0.00000
title: Mulliken charges with hydrogens summed into heavy atoms:
elementType: Br O O O N N N C C C C C C C C
charge: 0.111368 -0.273526 -0.217678 -0.178527 -0.122012 -0.031442 0.072435 0.255504 0.067973 0.031138 0.054305 0.120663 -0.205913 0.130111 0.185602
polarizability: 1.76387771e+02 5.30449921e+00 1.46743188e+02 -4.85857792e+00 -2.61323968e+00 7.71105350e+01
1716.lowfreq: -5.2144 -0.0005 -0.0002 0.0006 6.5586 8.2365 31.2086 38.0413 48.4908
frequency: 31.0914 37.8776 48.3955 71.2488 133.4665 142.4479 178.5035 231.0838 233.6133 237.2190 298.8553 309.1800 345.8277 397.2334 438.4288 447.9405 501.1882 529.5843 589.4867 610.9912 643.1287 719.8465 742.0750 767.4512 804.9480 817.0602 834.1710 864.8952 882.1765 930.7893 949.0484 992.7478 1023.2637 1045.9866 1061.9927 1093.1536 1123.4099 1163.6598 1169.9207 1191.5262 1215.9065 1231.4209 1252.2266 1268.5853 1281.8861 1307.5966 1330.1279 1340.2077 1347.0945 1348.3293 1362.5943 1368.9003 1380.6609 1431.8325 1449.1962 1455.4687 1459.6588 1460.9747 1475.9519 2953.8013 2958.1531 2979.5478 2996.6089 3001.3047 3054.2833 3060.8520 3069.9436 3096.5846 3274.1304
redmass: 11.3114 4.3851 6.2445 4.7739 12.3075 6.8670 4.8685 2.2637 7.3149 6.9336 3.4474 8.8884 2.9632 4.7623 4.0260 4.3068 6.2902 1.7890 7.6934 12.3450 4.1596 12.9564 7.6015 3.4745 2.8860 1.3915 1.7116 2.4089 2.5569 1.9866 4.3989 2.2125 3.2532 2.3322 4.8190 2.2734 2.2687 1.4133 2.3213 1.5055 2.9135 2.2657 1.2728 1.8084 4.7173 1.2897 1.4016 1.4038 1.8784 2.7848 1.2809 12.5357 1.5243 4.7129 1.1036 7.7252 1.0945 1.1061 1.0899 1.0702 1.0828 1.0660 1.0608 1.0603 1.0969 1.1018 1.1036 1.0969 1.0995
irintensity: 0.4674 0.7893 0.1956 0.4776 0.2059 1.1329 0.0773 4.7214 0.3043 0.8303 1.9678 1.3465 0.6446 1.9071 0.5918 3.9600 1.3633 5.9717 2.9067 4.4390 12.9423 0.6791 28.8008 39.0454 2.3522 22.1022 5.5777 4.1511 34.3762 10.2293 27.8520 26.6657 145.5561 5.1674 4.9023 15.5666 3.4418 6.0384 11.7790 78.5169 237.1823 9.3526 5.6177 15.1755 44.7549 1.5943 4.9216 0.2246 11.4186 12.8792 15.1538 93.7236 44.6440 30.3371 3.9457 157.7611 20.7382 6.3832 10.7132 42.2345 29.0108 29.4205 28.2603 17.6405 28.4308 30.6837 37.8469 26.1624 3.9396
temp: 298.150 k
press: 1.00000 atm
elementType: 35 8 8 8 7 7 7 6 6 6 6 6 6 6 6 1 1 1 1 1 1 1 1 1 1
symmnumber: 1
zpe: 483582.9 jmol-1
zpe.correction: 0.184187 hartree
zpe.thermalcorrener: 0.197904 hartree
zpe.thermalcorrenthalpy: 0.198849 hartree
zpe.thermalcorrgfe: 0.141092 hartree
zpe.sumelectzpe: -712.984352 hartree
zpe.sumelectthermal: -712.970635 hartree
zpe.sumelectthermalent: -712.969690 hartree
zpe.sumelectthermalfe: -713.027447 hartree
dipole: 10.5501 3.0511 0.2783
dipole: 10.9859
quadrupole: -106.0573 -101.8811 -94.5456
quadrupole: -7.2283 2.1644 -0.4186
quadrupole: -5.2294 -1.0531 6.2824 -7.2283 2.1644 -0.4186
hfenergy: -713.1685389 hartree
pointgroup: C01 [X(C8H10Br1N3O3)]
dipole: -4.2389319 0.8439187 -0.0249293 debye
dipolederiv: -0.0010663 0.1231108 0.0281291 0.0848704 -0.434371 -0.1074281 0.0199607 -0.1015653 0.0728298 -1.1071436 -0.0954295 0.0804787 -0.1904214 -0.397482 0.1110221 0.1986997 0.0905952 -0.5406534 -0.6559162 -0.0841277 0.0106819 -0.2392836 -0.6399371 -0.0555071 -0.0088553 -0.0595443 -0.2425567 -0.797245 0.2934345 0.0832418 0.193081 -0.56418 -0.0712895 0.0789102 -0.0825101 -0.226047 -1.0273657 0.1290236 0.0549686 -0.1232463 -0.2623208 0.0219721 0.0457207 -0.0131363 -0.1172078 -0.3757092 -0.0239518 -0.0183405 0.1875668 -0.4513236 -0.0597787 0.0639853 -0.0386379 -0.1969189 1.9086564 -0.257096 -0.1502498 0.1583415 1.0280732 0.132406 -0.103915 0.1580596 0.2237065 1.2083902 0.1055536 -0.00142 0.1843214 0.4250335 -0.1170227 -0.1725647 -0.1046139 0.5979268 -0.168176 0.0172667 -0.016933 -0.0414043 0.0451531 0.0526965 0.0619204 0.0758307 -0.0528273 0.0701789 -0.0123496 0.0072984 -0.0148819 0.1177822 0.0362193 -0.1003628 0.0662916 0.077012 -0.0478624 -0.0176069 -0.0265626 0.0543624 0.0598583 0.057558 -0.0379367 0.0813965 -0.0130245 0.8628365 0.0379846 -0.0976958 -0.134841 0.2549711 0.0847511 -0.0560146 0.0205051 0.3860758 0.824342 -0.1861743 -0.0685292 -0.0436229 0.7763097 0.1803739 -0.0599167 0.171178 -0.0432376 0.1249082 -0.0355775 -0.0246612 -0.2142612 0.1960907 0.0233887 -0.1382773 0.0092009 -0.0416868 -0.8148649 0.0726943 0.051008 0.1419112 0.0236576 -0.002248 0.0963308 -0.01766 0.072244 -0.0183058 0.0174259 0.0085769 0.0038522 -0.0735752 -0.0530284 -0.007656 -0.0622517 -0.0518298 0.0585559 0.0416896 -0.0034426 0.0523528 -0.0373874 -0.112476 0.0106363 -0.0550648 0.0012651 0.0034963 -0.0856094 0.0504808 -0.1048055 -0.0313877 0.0741876 0.0638785 0.0383682 0.0489795 -0.0280104 0.0287495 -0.0772872 0.0306712 0.0571727 0.0615115 -0.0934418 0.0816852 -0.1040056 0.0361075 -0.0236121 0.0166305 0.0063876 -0.0869364 -0.0888767 0.0590481 -0.1441048 -0.0111629 -0.1953147 0.0197968 0.0507514 0.0622379 0.0772992 0.0016232 0.0451323 0.0013607 0.0683618 0.1110654 0.0210831 0.016928 -0.0308979 -0.0765394 -0.0844945 -0.0266592 -0.0891597 -0.0490704 -0.0520319 -0.0219926 -0.0134726 0.0986649 -0.0572822 -0.1823851 0.0170926 -0.0881809 -0.0650154 -0.0186755 -0.040142 0.0355757 -0.0756612 -0.0579867 0.1088307 0.0391418 0.0670622 0.0368843 0.0991504 -0.0241436 0.0038446 -0.0452938 0.1093085 -0.0120058 0.0051426 -0.0051042 0.1699586 unknown
polarizability: 177.0864009|-2.1396267|144.8645727|-5.2547368|9.2267176|78.2905199 unknown
InChI: InChI=1S/C8H10BrN3O3/c9-7-8(12(13)14)10-5-11(7)6-3-1-2-4-15-6/h5-6H,1-4H2
charge 0 multiplicity 1
25 atoms
Br 0.94863 2.463134 0.519755
O  -2.225038 -0.913933 0.81096
O  3.853673 1.255013 0.068072
O  4.352677 -0.942579 -0.334285
N  -0.115339 -0.20764 0.1289
N  1.637717 -1.599936 -0.244858
N  3.521007 0.012695 -0.112028
C  -1.51747 0.239524 0.25821
C  -2.120851 0.677184 -1.093145
C  -3.620553 1.010307 -0.904381
C  -4.360198 -0.185416 -0.259391
C  -3.657229 -0.603423 1.044015
C  1.036309 0.585271 0.179638
C  0.302292 -1.517884 -0.13119
C  2.102978 -0.302002 -0.056564
H  -1.543402 1.085555 0.979311
H  -2.000477 -0.15293 -1.814791
H  -1.56432 1.549575 -1.482058
H  -4.072493 1.26858 -1.878386
H  -3.724261 1.905055 -0.256472
H  -5.412084 0.07651 -0.037345
H  -4.37041 -1.042924 -0.958732
H  -3.728493 0.205286 1.803887
H  -4.070477 -1.531944 1.467975
H  -0.397485 -2.344277 -0.192096
