program: Gaussian 09
title: 000028248
version: EM64L-G09RevD.01
frameworkgroup: C1[X(C21H26O4)]
method: RPBEPBE
basis: SDD
operation: Freq
keyword: #pfreq=noraman
keyword: PBEPBE/SDD
title: #p freq=noraman PBEPBE/SDD
converged: YES YES NO NO
title: Mulliken charges:
elementType: O O O O C C C C C C C C C C C C C C C C C C C C C H H H H H H H H H H H H H H H H H H H H H H H H H H
charge: -0.294689 -0.266910 -0.194154 -0.236780 0.313776 -0.270238 -0.412420 -0.745776 -0.734583 -0.261427 0.285920 0.356607 -0.150064 -0.793439 -0.789866 -0.556028 0.271817 0.178262 -0.018660 -0.813718 -0.604632 0.325466 -0.399869 -0.270445 -0.178587 0.259479 0.267425 0.214771 0.210072 0.261160 0.223045 0.212823 0.223957 0.197345 0.281818 0.221682 0.222766 0.234923 0.218930 0.218912 0.228220 0.268694 0.259260 0.258525 0.248708 0.239344 0.282703 0.237018 0.261386 0.250022 0.257448
chargesum: 0.00000
title: Mulliken charges with hydrogens summed into heavy atoms:
elementType: O O O O C C C C C C C C C C C C C C C C C C C C C
charge: -0.294689 -0.266910 -0.194154 -0.236780 0.313776 -0.010758 -0.144995 -0.059773 -0.074758 -0.064082 0.285920 0.356607 0.131754 -0.114068 -0.123804 -0.028074 0.271817 0.178262 -0.018660 -0.067142 -0.084911 0.325466 -0.138483 -0.020424 0.078861
polarizability: 2.99031878e+02 1.87188266e+01 2.53161233e+02 -4.91538212e+00 -7.54992188e+00 1.93003661e+02
1716.lowfreq: -15.1560 -9.8835 -2.8210 -0.0007 -0.0005 0.0002 0.1824 14.1024 16.3892
frequency: -13.7913 13.9231 16.2577 19.9582 26.3134 38.9405 47.1419 74.5710 79.6340 92.8742 104.6380 109.6253 120.8037 130.5241 151.4315 164.4531 174.3788 192.2559 196.8479 214.3392 225.9209 245.5061 249.8029 256.1790 265.3668 287.6748 318.6701 336.5607 344.8517 364.2809 375.5803 416.7354 429.9598 455.9147 496.7052 502.7011 511.7284 550.8334 566.5142 589.6791 596.2466 608.8039 623.1475 658.3671 690.6506 719.7029 722.7756 724.1022 752.2271 801.3759 813.8851 820.2312 825.6692 856.8163 869.8418 871.2204 878.8020 884.9512 903.1402 935.5127 950.3135 954.8035 962.0038 972.5973 977.6233 990.2989 997.3352 1009.7398 1027.6098 1035.1255 1035.4747 1048.5763 1050.1084 1052.3308 1073.7981 1081.0248 1086.3408 1109.6457 1124.6312 1128.7257 1151.1297 1152.2086 1165.4489 1195.5697 1197.5472 1212.3635 1219.8401 1241.8829 1243.6599 1284.0003 1286.3015 1308.2547 1309.7979 1326.3842 1346.9511 1365.6721 1373.5860 1389.3425 1391.0538 1396.8741 1400.9905 1402.1658 1418.4198 1430.3000 1451.2928 1453.7792 1454.2407 1462.4693 1464.8214 1466.5933 1470.9015 1471.3943 1476.3672 1484.0811 1490.5500 1495.2761 1592.8452 1619.3506 1624.5391 1666.6341 1684.4318 2958.5788 2966.6480 2971.2311 2975.8026 2976.0629 2979.6338 3011.5422 3019.4294 3027.3527 3029.7140 3033.8971 3048.2976 3059.6524 3068.4674 3078.6137 3082.0997 3090.4921 3090.5470 3097.0130 3098.0047 3102.2811 3122.7070 3153.1348 3217.8639 3233.6054 3267.5389
redmass: 4.4317 4.2021 4.1551 3.8136 3.8061 4.4299 5.7664 4.3525 3.2025 3.6271 1.4468 1.1123 1.9720 2.6591 2.5610 1.3752 1.2727 2.8571 2.9869 2.1397 1.7047 2.2794 3.8754 3.5367 3.1174 3.6155 4.4432 3.0399 3.5102 3.9538 2.7741 2.4768 3.5965 2.6795 2.8060 2.5910 3.2465 4.5466 4.4350 3.5552 4.3002 3.6687 4.3496 5.4551 4.8178 1.2967 5.0355 4.1362 3.7033 3.7811 1.2675 3.3500 3.3666 1.6765 1.5844 5.1043 2.5949 2.5561 3.6272 2.1190 1.3962 1.7010 1.7327 2.3793 1.5903 1.2561 1.8283 1.5906 2.2421 2.2104 1.7700 2.5275 2.7642 1.6873 1.3832 1.6048 2.3856 2.1947 1.8088 1.4902 2.8808 1.3053 2.5468 1.8261 1.9792 1.6231 1.4865 2.2881 1.6254 1.6895 1.9191 1.5273 1.7925 1.7245 2.7442 1.7059 2.3574 1.2476 1.2735 1.3697 1.2195 1.3401 2.0212 1.0950 1.0609 1.0956 1.0656 1.0521 1.0941 1.0511 1.0492 1.0478 1.0854 1.1405 1.0583 4.6913 6.1113 9.9056 11.4252 8.5845 6.3182 1.0372 1.0390 1.0586 1.0370 1.0383 1.0364 1.0833 1.0998 1.0620 1.0968 1.0962 1.0955 1.0990 1.0990 1.0980 1.0973 1.1006 1.0912 1.0962 1.0984 1.0985 1.0876 1.0888 1.0915 1.0991 1.1083
irintensity: 0.4138 0.4367 0.1811 0.3862 0.7607 1.2438 1.3382 1.9024 1.0177 2.6214 0.0952 0.5169 1.1056 0.4373 0.8778 1.0269 0.6093 3.1629 0.7549 5.5304 1.1419 5.6999 3.1020 0.5080 7.5872 5.2792 3.9140 2.1799 2.5618 15.8162 9.0103 0.6360 2.0931 5.0289 8.5129 3.9413 6.8640 1.3959 4.8935 7.3466 3.1028 0.2329 3.1889 1.2685 13.0570 72.6846 5.9430 23.3846 4.5810 33.4828 20.3512 1.4394 1.0075 36.2520 1.5677 2.7492 20.8852 63.8125 6.9204 2.6239 2.2560 35.7727 9.5353 84.6355 109.7028 1.4421 16.2919 33.9421 22.7552 41.5287 23.3171 8.3837 37.3507 47.2352 6.5542 3.4383 18.9828 451.6430 7.4541 8.6360 23.5163 10.8503 41.5299 13.7325 55.6168 1.8041 3.3047 29.6099 24.2084 34.9080 42.4912 1.5744 4.1065 21.5220 12.2146 98.4536 6.7458 1.5334 52.4999 44.0436 11.4912 26.9243 63.1588 25.2244 31.2096 0.1257 2.2264 16.1232 41.3633 7.5176 13.9454 14.9066 3.2895 15.5007 12.6799 8.5291 18.0254 155.0807 323.6730 2.4467 8.1807 45.1487 57.2279 16.7189 27.7166 8.0771 48.4514 30.0346 4.7034 5.5860 9.7050 41.4128 9.3149 16.6135 41.9861 18.3528 27.0955 14.7280 21.8096 28.7970 10.2686 18.5304 10.4791 3.9555 6.3250 0.6435 0.6950
temp: 298.150 k
press: 1.00000 atm
elementType: 8 8 8 8 6 6 6 6 6 6 6 6 6 6 6 6 6 6 6 6 6 6 6 6 6 1 1 1 1 1 1 1 1 1 1 1 1 1 1 1 1 1 1 1 1 1 1 1 1 1 1
symmnumber: 1
zpe: 1093298.1 jmol-1
zpe.correction: 0.416415 hartree
zpe.thermalcorrener: 0.442789 hartree
zpe.thermalcorrenthalpy: 0.443733 hartree
zpe.thermalcorrgfe: 0.356026 hartree
zpe.sumelectzpe: -1114.804792 hartree
zpe.sumelectthermal: -1114.778418 hartree
zpe.sumelectthermalent: -1114.777474 hartree
zpe.sumelectthermalfe: -1114.865181 hartree
dipole: 4.7057 3.3003 0.0537
dipole: 5.7480
quadrupole: -160.0846 -148.4237 -144.6535
quadrupole: -9.2827 8.2058 1.2530
quadrupole: -9.0306 2.6302 6.4004 -9.2827 8.2058 1.2530
hfenergy: -1115.2212068 hartree
pointgroup: C01 [X(C21H26O4)]
dipole: -1.9841195 0.4195419 1.000641 debye
polarizability: 302.6737095|-10.5445923|193.0227825|-11.7127721|1.9858325|249.5002793 unknown
InChI: InChI=1S/C21H26O4/c1-12(2)9-16-19(21(16,4)5)20(23)25-18-11-17(22)15(13(18)3)10-14-7-6-8-24-14/h6-9,16,18-19H,10-11H2,1-5H3
charge 0 multiplicity 1
51 atoms
O  -0.072178 0.093593 -1.064312
O  -1.75806 -1.356004 -1.812574
O  4.483749 -0.367001 -2.20024
O  5.239614 -0.422402 2.777646
C  -3.530079 1.31706 -1.829066
C  -3.774091 0.551258 -0.520166
C  -2.302078 0.881817 -0.964567
C  -3.824019 0.595692 -3.143022
C  -3.791251 2.822423 -1.885118
C  -4.332129 1.165183 0.711533
C  -1.418354 -0.241479 -1.338153
C  -5.086329 0.540805 1.666057
C  0.964045 -0.945097 -1.375309
C  -5.48651 -0.923545 1.634284
C  -5.599287 1.311009 2.871664
C  1.992429 -0.401763 -2.385121
C  1.752639 -1.240937 -0.103773
C  3.098877 -1.046021 -0.294123
C  3.352751 -0.575527 -1.684801
C  1.048838 -1.695645 1.139877
C  4.230919 -1.26012 0.681175
C  4.266259 -0.221447 1.770915
C  3.571748 0.947641 2.036024
C  4.123463 1.512112 3.254438
C  5.126839 0.659658 3.674734
H  -4.014475 -0.505977 -0.680706
H  -1.793471 1.68946 -0.431254
H  -4.8950 0.707241 -3.396745
H  -3.233168 1.032445 -3.97057
H  -3.58821 -0.47971 -3.086341
H  -4.869379 3.017925 -2.037578
H  -3.479968 3.345802 -0.964651
H  -3.239544 3.273954 -2.730159
H  -4.112673 2.232749 0.860304
H  0.420698 -1.838446 -1.7387
H  -5.140063 -1.439081 2.551927
H  -6.589986 -1.024334 1.615814
H  -5.083015 -1.47192 0.768365
H  -6.706352 1.28276 2.920202
H  -5.231486 0.861499 3.815755
H  -5.285237 2.369015 2.850656
H  1.812216 0.670341 -2.579907
H  1.981237 -0.924685 -3.356056
H  0.409141 -0.882307 1.533711
H  1.753168 -1.98739 1.935114
H  0.374554 -2.545714 0.920884
H  5.180792 -1.228117 0.111305
H  4.166775 -2.265969 1.141942
H  2.767336 1.360843 1.431085
H  3.812434 2.431599 3.746598
H  5.816271 0.648151 4.5140
