program: Gaussian 09
title: 000292749
version: EM64L-G09RevD.01
frameworkgroup: C1[X(C13H11Cl2N3O)]
method: RPBEPBE
basis: SDD
operation: Freq
keyword: #p
keyword: freq=noraman
keyword: PBEPBE/SDD
title: #p freq=noraman PBEPBE/SDD
converged: YES YES NO NO
title: Mulliken charges:
elementType: Cl Cl O N N N C C C C C C C C C C C C C H H H H H H H H H H H
charge: -0.047410 -0.068209 -0.337357 -0.515147 -0.394256 -0.498587 0.325459 0.106060 0.471605 -0.321630 -0.317528 -0.108783 -0.297165 -0.348206 -0.449388 0.184094 -0.080625 -0.176887 -0.270963 0.376087 0.298408 0.225088 0.261616 0.293961 0.249286 0.233061 0.258913 0.332513 0.305715 0.310275
chargesum: 0.00000
title: Mulliken charges with hydrogens summed into heavy atoms:
elementType: Cl Cl O N N N C C C C C C C C C C C C C
charge: -0.047410 -0.068209 -0.337357 -0.139060 -0.061743 0.117403 0.325459 0.106060 0.471605 -0.023222 -0.092440 -0.108783 -0.035548 -0.054245 -0.200102 0.184094 -0.080625 0.056174 -0.012051
polarizability: 2.87277972e+02 -5.42994499e+00 2.32994134e+02 -9.14710374e+00 2.05051156e+01 1.00193605e+02
1716.lowfreq: 0.0012 0.0018 0.0021 2.0418 3.1945 6.9729 26.9055 42.0532 52.4011
frequency: 26.8742 42.0490 52.3943 66.5940 86.8070 118.8147 131.8329 154.2983 172.2739 185.4053 195.0165 239.2203 258.6342 283.5138 293.6212 309.7553 362.4284 365.7303 390.8546 435.0877 440.6468 483.8481 503.6274 553.5624 553.7726 579.5957 585.3028 640.6489 668.1362 676.2342 690.2491 700.7379 747.0351 776.0639 777.9809 802.4747 846.2218 853.7900 858.2950 870.6319 893.3163 905.4720 921.2098 935.8747 969.6574 978.8165 1038.2606 1070.5471 1086.1099 1097.6100 1141.3151 1176.9452 1193.4498 1222.1815 1254.6143 1285.9222 1287.1562 1301.2385 1303.8672 1364.8315 1381.7929 1415.0819 1423.1627 1442.7329 1464.0800 1476.6943 1508.1576 1553.7202 1567.8230 1601.8361 1616.3489 1628.7670 1681.1468 3136.9729 3137.5183 3157.0762 3173.6155 3177.1056 3181.5475 3184.7578 3189.5611 3390.0539 3505.6368 3572.8725
redmass: 8.1732 5.7014 12.2083 5.7959 5.5702 3.9308 1.5051 6.4063 3.2249 5.0263 5.6990 6.4004 5.6254 8.8742 6.6682 5.7358 5.9883 5.9943 10.0699 3.1534 3.2827 6.1711 6.0113 2.1787 1.9319 5.3393 5.3104 5.7073 5.2833 3.1682 4.3335 4.7730 2.8802 1.5984 1.4868 1.6521 1.4983 4.1801 1.8353 2.3268 1.6825 1.3198 4.7946 1.3560 1.3432 5.5470 4.8754 2.0697 1.9195 1.6379 1.7565 1.0853 3.0366 2.4148 1.6372 1.3484 1.2267 2.1679 1.7367 3.7410 7.6090 4.0373 3.3488 2.5844 2.0496 2.4183 4.6763 6.3124 6.9926 5.9100 4.7380 2.3030 1.0606 1.0892 1.0874 1.0944 1.0812 1.0924 1.0972 1.0954 1.0922 1.0429 1.0986 1.0791
irintensity: 0.3789 1.2057 0.1750 0.3299 0.2159 4.5735 16.6930 2.7562 5.8015 0.6292 0.5533 5.7302 2.2162 3.9570 6.2488 12.0327 1.2979 30.5880 14.1990 6.3747 4.7664 4.2750 31.0912 82.8321 67.6702 5.1879 14.5145 7.9019 19.5615 18.2003 20.4344 28.7271 11.8611 135.2088 52.2250 43.5400 24.5927 38.1341 135.6245 54.2697 50.8040 5.5116 21.4086 0.4370 2.4498 9.2881 20.0003 11.2809 33.8706 17.4654 0.7448 5.0578 7.6874 11.6752 51.1519 4.5570 5.8283 203.2616 19.9352 41.9494 15.8399 15.8478 22.3752 122.6161 255.5953 46.1764 482.0925 57.8858 242.0672 637.7304 41.3567 120.8643 34.2789 10.9013 8.5553 9.0179 332.2423 19.4665 3.2902 0.8917 0.0524 1.1959 2.5683 52.4507
temp: 298.150 k
press: 1.00000 atm
elementType: 17 17 8 7 7 7 6 6 6 6 6 6 6 6 6 6 6 6 6 1 1 1 1 1 1 1 1 1 1 1
symmnumber: 1
zpe: 572870.8 jmol-1
zpe.correction: 0.218195 hartree
zpe.thermalcorrener: 0.235722 hartree
zpe.thermalcorrenthalpy: 0.236666 hartree
zpe.thermalcorrgfe: 0.171040 hartree
zpe.sumelectzpe: -1660.235551 hartree
zpe.sumelectthermal: -1660.218024 hartree
zpe.sumelectthermalent: -1660.217080 hartree
zpe.sumelectthermalfe: -1660.282706 hartree
dipole: -3.0330 -1.8895 -0.3919
dipole: 3.5948
quadrupole: -114.6952 -123.7446 -126.5710
quadrupole: -7.1491 -6.0222 4.2436
quadrupole: 6.9751 -2.0743 -4.9007 -7.1491 -6.0222 4.2436
hfenergy: -1660.4537458 hartree
pointgroup: C01 [X(C13H11Cl2N3O1)]
dipole: -1.0986376 -0.8432717 -0.2866586 debye
polarizability: 288.3190235|-2.0475459|230.5527682|5.2071966|25.045041|101.5939198 unknown
InChI: InChI=1S/C13H11Cl2N3O/c14-8-2-1-3-10(6-8)17-12-7-9(15)4-5-11(12)13(19)18-16/h1-7,17-18H,16H2
charge 0 multiplicity 1
30 atoms
Cl -0.768076 4.471513 -0.301927
Cl 4.555885 1.287808 1.76284
O  -1.850802 -2.356517 -0.548086
N  0.186852 -0.681849 -0.440553
N  -3.848744 -1.645238 0.366319
N  -4.378456 -2.961312 0.428604
C  -0.72864 0.357622 -0.298417
C  -2.13788 0.043166 -0.179876
C  1.594133 -0.667149 -0.31016
C  -0.336017 1.731352 -0.325257
C  -3.078361 1.107083 -0.125103
C  -1.30765 2.73268 -0.239097
C  -2.689529 2.457492 -0.140287
C  2.287039 0.229375 0.551837
C  2.334048 -1.655141 -1.020692
C  -2.584733 -1.377407 -0.145429
C  3.685091 0.127785 0.650482
C  3.733297 -1.734179 -0.883824
C  4.43816 -0.832245 -0.050999
H  -0.277308 -1.59292 -0.645401
H  0.71076 2.002389 -0.471321
H  -4.151119 0.884813 -0.108636
H  -3.42388 3.264903 -0.099848
H  1.748981 0.952357 1.16885
H  1.802723 -2.348821 -1.681387
H  4.289352 -2.497373 -1.438387
H  5.525479 -0.877976 0.049398
H  -4.395135 -0.935727 0.853123
H  -4.570697 -3.314113 -0.519896
H  -3.718073 -3.587972 0.912331
