program: Gaussian 09
title: 000292738
version: EM64L-G09RevD.01
frameworkgroup: C1[X(C5H10BrNO3S)]
method: RPBEPBE
basis: SDD
operation: Freq
keyword: #p
keyword: freq=noraman
keyword: PBEPBE/SDD
title: #p freq=noraman PBEPBE/SDD
converged: YES YES NO NO
title: Mulliken charges:
elementType: Br S O O O N C C C C C H H H H H H H H H H
charge: 0.097513 0.977183 -0.243232 -0.511611 -0.533743 -0.265010 -0.421403 -0.410133 -0.286766 -0.292584 -0.717840 0.264530 0.256423 0.255083 0.263683 0.226955 0.222917 0.232217 0.226500 0.325035 0.334282
chargesum: 0.00000
title: Mulliken charges with hydrogens summed into heavy atoms:
elementType: Br S O O O N C C C C C
charge: 0.097513 0.977183 -0.243232 -0.511611 -0.533743 -0.265010 0.099550 0.108633 0.163106 0.166134 -0.058524
polarizability: 1.34663925e+02 6.34176458e+00 1.13373554e+02 -7.15434932e+00 -3.10196434e+00 8.90690719e+01
1716.lowfreq: -10.4161 0.0006 0.0009 0.0009 7.5884 13.6926 33.8168 40.4544 90.9312
frequency: 33.7729 39.1464 90.9066 96.6351 152.9292 170.6870 197.7723 221.4110 235.2059 301.1729 321.9666 361.1666 372.0779 405.4683 460.2876 476.6410 549.4557 619.4168 634.5123 775.6215 781.1523 804.4902 810.9483 819.9397 875.5585 930.8217 998.5150 1015.2864 1020.6840 1066.0115 1095.6780 1098.3837 1107.5388 1182.3649 1198.3480 1245.1777 1255.7103 1290.1262 1322.8117 1338.2533 1342.3096 1349.5461 1371.9120 1412.6515 1419.8150 1456.5161 1462.4142 2962.5345 2973.2615 2999.3463 3003.5584 3074.4690 3078.2363 3081.5375 3084.6018 3087.5117 3200.3393
redmass: 7.6482 4.5737 4.8569 7.4948 3.4492 3.9200 11.0813 4.8434 4.4492 3.8071 3.6043 3.6768 4.9158 2.2526 6.0033 3.0749 5.2930 3.6712 3.0767 3.5711 4.1605 1.7728 3.5341 2.3264 2.9613 11.4527 2.5962 2.3456 1.9332 4.9199 1.1704 1.8366 4.5328 1.0738 1.1290 1.1616 1.2244 1.1327 1.2516 1.2122 1.3117 1.0833 1.2427 1.0805 1.0790 1.0762 1.0920 1.0674 1.0666 1.0611 1.0624 1.0999 1.0512 1.0984 1.0985 1.1011 1.1164
irintensity: 1.0150 0.1103 1.3164 2.9874 4.0398 5.0318 2.0212 17.6448 6.4948 4.4947 47.0924 20.0042 19.1695 3.5452 1.0510 0.3316 16.6665 93.3113 29.7209 23.2985 8.8442 4.5935 41.2668 54.3289 1.9623 78.1831 0.6651 15.2172 16.8414 27.1112 1.8405 11.7884 11.2983 0.7443 32.2495 23.6336 2.7595 6.3020 0.0413 3.4953 2.2429 2.6502 5.6471 28.0065 10.6461 5.1522 18.2210 26.7194 24.9089 2.4576 19.6548 8.1300 1.5471 12.2187 23.9278 24.1959 0.9157
temp: 298.150 k
press: 1.00000 atm
elementType: 35 16 8 8 8 7 6 6 6 6 6 1 1 1 1 1 1 1 1 1 1
symmnumber: 1
zpe: 407535.5 jmol-1
zpe.correction: 0.155222 hartree
zpe.thermalcorrener: 0.167760 hartree
zpe.thermalcorrenthalpy: 0.168704 hartree
zpe.thermalcorrgfe: 0.114410 hartree
zpe.sumelectzpe: -887.377910 hartree
zpe.sumelectthermal: -887.365372 hartree
zpe.sumelectthermalent: -887.364428 hartree
zpe.sumelectthermalfe: -887.418722 hartree
dipole: -0.9030 -1.0037 -3.0662
dipole: 3.3503
quadrupole: -85.7988 -84.1560 -85.7263
quadrupole: -1.5893 -1.4909 -4.4354
quadrupole: -0.5717 1.0710 -0.4992 -1.5893 -1.4909 -4.4354
hfenergy: -887.5331325 hartree
pointgroup: C01 [X(C5H10Br1N1O3S1)]
dipole: -0.0416935 0.2846863 -1.2863241 debye
dipolederiv: -0.15804 -0.0705602 -0.0942333 -0.2648228 -0.2425904 -0.2313855 -0.2028981 -0.160895 -0.188036 1.6730802 0.0646394 0.0094634 -0.2134293 0.9381707 -0.1716877 0.1341029 0.0059523 1.0494364 -0.5230615 -0.0238791 -0.0950431 -0.0123286 -0.7037746 -0.0038965 -0.0514931 -0.0078398 -0.4404568 -0.7130357 -0.0407463 0.0521522 -0.0648066 -0.5285656 0.2597532 0.0687044 0.0787597 -0.5856552 -0.7714257 -0.0155975 -0.0223864 0.1315061 -0.627525 -0.1948058 -0.0149437 -0.1164091 -0.5714217 -0.4268722 0.0097324 -0.184792 0.0362479 -0.3327006 0.0262414 -0.4789265 0.0037484 -0.3125793 0.0878366 0.0773461 0.0280099 0.2363292 0.1070572 -0.0535138 0.1769524 0.0341982 0.0679353 0.0293543 -0.0802037 0.0249327 -0.2301587 0.1336426 0.0505054 0.1498464 -0.0187257 0.0806971 0.3167143 -0.1503867 -0.0553562 -0.1326827 0.4537169 0.0482987 -0.0155849 -0.0027224 0.2709494 0.3644669 0.1872388 -0.0404885 0.1430449 0.4113553 -0.0178172 0.011034 0.0245196 0.2548307 0.1749189 0.1863839 0.1606109 0.3941829 0.3357599 0.3890479 0.2842811 0.3256202 0.1991735 0.0449077 0.1227256 -0.0204714 0.0504436 -0.0014314 0.009764 -0.0645889 -0.0496634 0.0958963 -0.0300713 -0.0689209 0.076545 -0.0924368 0.0941394 0.0012662 0.0178995 0.0029533 -0.0466256 -0.0000068 0.0557624 0.0790509 0.109184 0.0743292 -0.0042198 0.0318545 0.0047833 -0.04552 0.0011823 -0.1143624 -0.0313951 -0.0512468 0.0121053 -0.0105098 -0.0527379 0.0284114 0.093415 -0.0597198 -0.1265306 -0.0173099 -0.0865128 -0.0650832 -0.0087514 -0.0046141 0.010076 0.1029205 0.0056972 0.0842068 0.1205956 0.0202561 0.0123132 0.0328055 0.0555189 -0.0117674 -0.0822703 0.0109903 -0.0891449 0.1015983 -0.023857 0.0329078 -0.045239 0.0470637 0.0158297 -0.0730368 -0.0240797 0.1096103 -0.0073135 0.0793878 -0.0968174 -0.0083048 0.0001857 -0.0313573 0.1022035 0.0042448 -0.0725071 -0.0492154 -0.0422593 -0.0333055 0.009102 -0.0487187 -0.0554329 0.0202741 -0.007081 -0.0448061 -0.0349539 0.0139589 0.0262962 -0.0766531 -0.0429376 -0.0800391 0.0078698 unknown
polarizability: 127.9762521|10.8526898|114.1445766|6.3280747|13.7557461|94.9857228 unknown
InChI: InChI=1S/C5H10BrNO3S/c6-5-11(8,9)7-1-3-10-4-2-7/h1-5H2
charge 0 multiplicity 1
21 atoms
Br -2.884343 -1.371872 -1.678565
S  -0.949643 0.201909 0.450798
O  3.138033 -0.174215 0.272071
O  -1.00938 -1.171034 1.326843
O  -0.933526 1.68023 1.157272
N  0.454727 0.128259 -0.888659
C  1.3855 1.290257 -0.701718
C  1.1579 -1.196117 -0.822233
C  2.411328 1.096046 0.432154
C  2.192023 -1.302997 0.317081
C  -2.507504 0.304794 -0.725117
H  0.787595 2.20221 -0.52912
H  1.906289 1.388002 -1.674057
H  1.664554 -1.28807 -1.802822
H  0.405545 -1.999239 -0.742649
H  3.181007 1.88456 0.402427
H  1.897833 1.126148 1.417234
H  1.674261 -1.334589 1.298556
H  2.807124 -2.210176 0.200621
H  -2.246816 1.099291 -1.435608
H  -3.336611 0.552402 -0.047808
