program: Gaussian 09
title: 000292783
version: EM64L-G09RevD.01
frameworkgroup: C1[X(C15H11ClF3NO)]
method: RPBEPBE
basis: SDD
operation: Freq
keyword: #p
keyword: freq=noraman
keyword: PBEPBE/SDD
title: #p freq=noraman PBEPBE/SDD
converged: YES YES NO NO
title: Mulliken charges:
elementType: Cl F F F O N C C C C C C C C C C C C C C C H H H H H H H H H H H
charge: -0.046645 -0.174361 -0.158245 -0.158038 -0.244908 -0.071039 0.178203 0.246168 0.265976 -0.457099 -0.320357 -0.377484 0.267588 0.455288 -0.374301 -0.359188 -0.364581 -0.216755 -0.204178 -0.102167 -0.533361 0.275604 0.250872 0.259770 0.217156 0.236124 0.280200 0.259304 0.258219 0.257640 0.227621 0.226974
chargesum: 0.00000
title: Mulliken charges with hydrogens summed into heavy atoms:
elementType: Cl F F F O N C C C C C C C C C C C C C C C
charge: -0.046645 -0.174361 -0.158245 -0.158038 -0.244908 -0.071039 0.178203 0.246168 0.265976 -0.181495 -0.069485 -0.117713 0.267588 0.455288 -0.157145 -0.123064 -0.084381 0.042549 0.054041 -0.102167 0.178874
polarizability: 4.30513912e+02 3.30867031e+01 1.71233095e+02 4.19299357e+00 -1.42911714e+01 9.03179975e+01
1716.lowfreq: -6.3258 -3.5407 -2.3559 -0.0017 -0.0016 -0.0015 23.5178 26.4513 37.9736
frequency: 23.4881 26.4201 37.9644 51.0204 72.0661 95.8479 109.8517 124.7053 150.2879 177.7225 182.0093 202.7217 239.3455 253.1691 294.5831 295.5416 323.6183 330.5019 347.2228 391.8842 396.5989 412.7945 432.4799 441.9232 471.8373 500.3858 518.2861 535.3717 577.9398 620.5747 624.7959 628.5201 664.9353 704.0724 718.3780 739.4971 746.7138 820.8654 827.6174 841.5368 844.5355 883.2830 905.7602 949.8298 959.6424 978.0532 983.4487 985.5474 990.5729 998.1080 1000.1678 1035.4397 1068.7635 1104.9931 1111.3233 1129.8884 1154.5033 1170.5210 1177.1076 1235.6587 1239.9150 1256.7905 1287.1875 1296.4307 1349.9007 1366.8186 1393.6693 1401.3863 1423.3713 1438.0624 1467.5403 1470.9682 1475.2055 1493.9218 1565.2250 1575.6014 1590.1469 1604.7491 1623.0974 2950.2357 2970.4500 3063.8777 3129.8274 3139.6530 3156.3802 3157.6058 3163.7149 3172.8031 3176.3650 3179.0207
redmass: 5.1469 7.5246 6.9295 10.4434 4.7915 5.7811 7.0189 5.0741 5.6569 4.4574 4.8111 3.3821 1.4226 6.4720 8.8007 6.5182 5.3168 6.0575 4.8911 9.3217 6.0578 2.9327 5.4526 7.5877 6.9353 3.4536 3.9776 7.8043 5.6631 7.5116 5.9806 5.7086 6.4929 7.8249 3.6618 4.1560 6.0990 1.4542 1.3826 2.7656 1.6585 5.7130 1.6216 1.3716 1.3689 2.5319 2.5843 5.3072 1.5159 3.9405 11.0107 4.6939 2.8263 1.3724 1.2567 1.4666 1.6510 1.7261 1.2276 3.3411 2.5289 2.3490 1.3119 1.5119 3.0147 6.1863 2.8596 3.1627 3.5037 1.3606 1.1309 1.0500 2.3564 2.5899 8.0437 7.8400 5.9963 6.5473 6.7057 1.0862 1.0327 1.1047 1.0900 1.1000 1.0884 1.0883 1.0911 1.0954 1.0974 1.0961
irintensity: 0.9502 0.2315 0.5606 0.5590 2.6723 1.2385 1.1593 0.6020 2.7944 8.3975 4.2266 5.1069 5.0152 1.8268 0.8597 3.3171 3.0199 2.3093 6.6508 25.4186 14.9666 0.0657 1.4256 6.1317 3.7968 8.8839 23.8573 1.4213 15.5792 4.1761 11.3309 7.8762 23.2289 9.0549 3.6205 2.4226 4.3634 12.7300 44.9255 14.1891 37.1455 99.2182 51.9234 1.8687 1.2284 46.5737 77.7917 77.5005 5.7622 47.1840 225.4479 66.0972 74.6757 7.7501 0.3457 52.8909 24.7269 26.6378 11.1696 245.2796 114.7936 184.4292 38.3236 33.9620 4.5400 68.2924 4.4218 9.3250 60.9714 1.7153 98.5431 16.0527 46.2453 203.9304 45.6242 14.6207 11.8082 34.9543 152.8420 55.1335 78.5163 38.4948 7.9931 17.6160 0.3231 5.1925 1.6060 4.9974 4.4843 9.7062
temp: 298.150 k
press: 1.00000 atm
elementType: 17 9 9 9 8 7 6 6 6 6 6 6 6 6 6 6 6 6 6 6 6 1 1 1 1 1 1 1 1 1 1 1
symmnumber: 1
zpe: 587379.4 jmol-1
zpe.correction: 0.223721 hartree
zpe.thermalcorrener: 0.242871 hartree
zpe.thermalcorrenthalpy: 0.243815 hartree
zpe.thermalcorrgfe: 0.173700 hartree
zpe.sumelectzpe: -1466.246641 hartree
zpe.sumelectthermal: -1466.227491 hartree
zpe.sumelectthermalent: -1466.226547 hartree
zpe.sumelectthermalfe: -1466.296662 hartree
dipole: -0.6968 -3.8121 -1.1023
dipole: 4.0289
quadrupole: -133.7371 -116.1472 -130.6480
quadrupole: 26.8181 1.3782 -3.2030
quadrupole: -6.8930 10.6969 -3.8039 26.8181 1.3782 -3.2030
hfenergy: -1466.4703621 hartree
pointgroup: C01 [X(C15H11Cl1F3N1O1)]
dipole: -0.2949774 1.5567558 -0.0454986 debye
polarizability: 430.4604853|-32.2706703|153.7081524|-16.7913073|-33.4865586|107.8963664 unknown
InChI: InChI=1S/C15H11ClF3NO/c1-21-14-7-6-12(8-13(14)15(17,18)19)20-9-10-2-4-11(16)5-3-10/h2-9H,1H3
charge 0 multiplicity 1
32 atoms
Cl 7.735739 -0.100504 -0.482793
F  -2.523916 -2.805836 0.983378
F  -4.117991 -1.594016 2.035426
F  -4.336308 -2.09129 -0.166351
O  -4.733044 0.725432 0.407967
N  0.892757 0.735389 -0.198091
C  -2.645571 -0.441309 0.464567
C  -3.353571 0.780492 0.250043
C  -0.513171 0.69207 -0.0198
C  -1.245329 -0.476523 0.332209
C  -2.632204 1.943589 -0.11921
C  -1.235227 1.889293 -0.265561
C  -3.396558 -1.695032 0.818799
C  3.152505 -0.071251 0.205965
C  1.700988 -0.075995 0.44192
C  3.987745 -0.952528 0.94603
C  3.74438 0.801708 -0.751208
C  5.383665 -0.969339 0.743826
C  5.134925 0.796701 -0.963203
C  5.934983 -0.091344 -0.210025
C  -5.510668 1.949107 0.178593
H  -0.729046 -1.430844 0.472785
H  -3.156185 2.885226 -0.301786
H  -0.669853 2.777272 -0.564601
H  1.342441 -0.791343 1.212604
H  3.543924 -1.629959 1.685719
H  3.090749 1.47434 -1.314897
H  6.027533 -1.646221 1.312145
H  5.595258 1.464797 -1.696729
H  -6.553508 1.656384 0.363465
H  -5.398277 2.302461 -0.863842
H  -5.212966 2.747275 0.884658
