program: Gaussian 09
title: 000292744
version: EM64L-G09RevD.01
frameworkgroup: C1[X(C13H15N5O5)]
method: RPBEPBE
basis: SDD
operation: Freq
keyword: #p
keyword: freq=noraman
keyword: PBEPBE/SDD
title: #p freq=noraman PBEPBE/SDD
converged: YES YES NO NO
title: Mulliken charges:
elementType: O O O O O N N N N N C C C C C C C C C C C C C H H H H H H H H H H H H H H H
charge: -0.306542 -0.304374 -0.286337 -0.267703 -0.272290 -0.451634 -0.092068 0.048387 -0.070990 -0.600893 0.530568 0.019316 0.348081 0.301975 -0.702502 -0.498703 0.197713 0.067368 0.181492 -0.345680 -0.523849 -0.527144 -0.525458 0.266190 0.343134 0.368642 0.250979 0.253445 0.235473 0.228682 0.231662 0.254445 0.223315 0.216278 0.261378 0.230465 0.376478 0.340699
chargesum: 0.00000
title: Mulliken charges with hydrogens summed into heavy atoms:
elementType: O O O O O N N N N N C C C C C C C C C C C C C
charge: -0.306542 -0.304374 -0.286337 -0.267703 -0.272290 -0.082992 -0.092068 0.048387 -0.070990 0.116284 0.530568 0.019316 0.348081 0.301975 -0.436312 -0.155569 0.197713 0.067368 0.181492 -0.094701 0.193751 0.182279 0.182664
polarizability: 4.17628192e+02 6.84567686e-01 2.29065682e+02 1.54699233e+00 4.80087925e-01 9.78110402e+01
1716.lowfreq: -3.5699 -0.0006 0.0008 0.0008 3.8002 7.6467 24.3475 33.8730 59.9289
frequency: 24.2790 33.7981 59.8908 66.0372 76.1229 86.1118 92.5304 99.1681 106.5969 145.8370 153.4703 161.1497 167.3363 180.0157 195.1702 211.4955 223.3742 235.5747 247.0662 283.9905 313.9145 328.5430 340.5025 369.7128 380.2848 406.0400 438.2490 469.9509 475.6751 502.7705 515.8022 548.8588 588.9707 598.0393 609.5551 634.7457 651.4170 665.8002 679.0412 705.0700 732.5170 739.1740 771.4389 781.3372 781.5500 857.4264 865.3767 875.6784 905.2278 925.2613 936.3833 937.7600 957.0971 967.8999 996.5528 1032.5684 1040.0558 1093.7793 1111.3464 1112.9657 1114.0507 1139.1519 1150.7978 1158.3833 1161.2773 1183.8822 1194.5235 1201.8068 1223.2832 1258.0995 1311.5632 1318.8201 1359.2005 1363.2681 1400.0396 1410.0206 1419.5969 1435.4985 1442.2534 1454.0606 1458.0147 1459.5393 1461.1556 1470.5905 1476.1717 1484.3458 1486.5037 1502.5008 1524.3615 1555.1715 1582.2845 1596.3796 1617.8877 2974.1685 2976.1475 2979.4634 3073.3522 3080.6751 3082.9620 3123.0363 3124.3514 3127.9348 3151.6578 3157.8975 3181.0322 3212.0993 3411.8911 3627.0392
redmass: 6.6768 5.1223 3.7199 4.1756 4.0383 3.1689 3.1270 6.8725 4.1919 2.0930 1.5653 1.3302 1.0873 4.9825 7.4803 4.1346 4.3389 5.5133 5.5978 5.7755 5.3563 5.2276 7.1862 5.4294 4.1520 10.9400 6.4055 6.2780 3.4180 6.1862 6.6873 6.4205 5.8454 6.4475 1.4725 4.4879 4.0295 8.0897 3.7228 7.7427 5.5161 1.1602 3.7544 6.1748 8.6794 3.0441 2.6257 5.8631 7.3583 1.2974 1.3812 8.9639 1.4443 3.0889 7.2450 3.4298 5.4613 2.7668 1.2420 1.2386 1.2396 2.4372 1.3690 1.5368 1.6961 2.3700 6.8756 1.7642 3.5173 6.9430 6.3895 5.2722 5.2194 1.5946 2.8800 2.1124 1.2971 1.2525 1.7560 1.8857 1.0658 1.1270 1.2733 2.9308 1.0656 1.0544 1.0583 1.8818 6.8773 5.7114 2.9678 3.3620 2.6477 1.0312 1.0334 1.0295 1.1037 1.1054 1.0993 1.1033 1.1029 1.1042 1.0927 1.0924 1.0800 1.0925 1.0515 1.0991
irintensity: 0.2534 2.0584 2.9003 0.9749 2.0618 2.4162 5.3478 4.8688 6.1259 1.2457 2.2268 0.7325 0.0453 1.8280 0.4347 1.3839 3.7045 3.4533 12.0495 13.0711 2.7981 3.5516 10.9415 8.7193 20.5278 2.4824 1.3254 7.0397 14.5187 3.7101 1.0578 2.9074 13.9884 15.4388 120.0818 11.2095 12.6600 0.2310 48.2722 7.9187 1.3378 77.7423 7.1835 47.1906 9.0338 2.2242 0.8213 7.6416 27.0275 3.6366 166.0621 81.2528 0.2149 42.0599 55.9101 50.4946 179.0283 28.0219 11.4883 16.5521 3.3115 14.8388 1.7201 11.5977 24.3267 192.6432 253.5177 16.0965 127.6004 101.7169 29.0447 196.3868 113.9952 230.7327 54.0833 31.0600 35.4041 46.7615 6.2729 153.8262 12.7049 8.6427 12.8551 83.5543 2.0147 17.7082 50.5147 12.3584 623.8653 230.6062 709.6162 59.5468 78.4472 67.0336 109.6241 71.2168 25.7149 19.0376 32.9650 28.2578 24.4430 15.4046 0.2070 17.6699 76.0155 20.8678 82.4687 125.0478
temp: 298.150 k
press: 1.00000 atm
elementType: 8 8 8 8 8 7 7 7 7 7 6 6 6 6 6 6 6 6 6 6 6 6 6 1 1 1 1 1 1 1 1 1 1 1 1 1 1 1
symmnumber: 1
zpe: 742591.2 jmol-1
zpe.correction: 0.282838 hartree
zpe.thermalcorrener: 0.305046 hartree
zpe.thermalcorrenthalpy: 0.305990 hartree
zpe.thermalcorrgfe: 0.230567 hartree
zpe.sumelectzpe: -1152.455967 hartree
zpe.sumelectthermal: -1152.433760 hartree
zpe.sumelectthermalent: -1152.432815 hartree
zpe.sumelectthermalfe: -1152.508238 hartree
dipole: 2.3151 1.3742 -1.0726
dipole: 2.8980
quadrupole: -101.7725 -143.1040 -131.2214
quadrupole: -10.7609 -2.0517 -0.1143
quadrupole: 23.5934 -17.7380 -5.8554 -10.7609 -2.0517 -0.1143
hfenergy: -1152.7388055 hartree
pointgroup: C01 [X(C13H15N5O5)]
dipole: 0.8571666 -0.6420323 0.3912374 debye
polarizability: 416.313431|-15.6096537|229.4575592|3.9616103|10.5554333|98.7339243 unknown
InChI: InChI=1S/C13H15N5O5/c1-21-8-4-7(5-9(22-2)11(8)23-3)17-13-10(18(19)20)12(14)15-6-16-13/h4-6,17H,14H2,1-3H3
charge 0 multiplicity 1
38 atoms
O  4.596979 -0.575731 -0.057063
O  3.613103 2.13358 0.18188
O  2.646481 -2.70755 -0.213238
O  -4.74064 2.505273 0.123941
O  -2.478309 2.722635 0.186944
N  -0.949769 0.620997 0.03542
N  -2.015616 -1.488592 -0.160029
N  -3.549578 1.957906 0.099635
N  -4.442891 -1.688312 -0.234207
N  -5.848465 0.149477 -0.106927
C  0.417102 0.233258 0.036506
C  3.211008 -0.301934 0.017946
C  2.728966 1.033071 0.14398
C  2.266227 -1.365916 -0.040196
C  1.35047 1.301739 0.141497
C  0.878587 -1.104456 -0.034846
C  -2.097077 -0.119172 -0.048512
C  -3.405075 0.53949 -0.020055
C  -4.572518 -0.319198 -0.119458
C  -3.17942 -2.177913 -0.245443
C  5.215311 -0.152063 -1.340291
C  4.540813 2.158187 1.338022
C  3.614625 -3.264849 0.758395
H  1.022588 2.343558 0.220847
H  0.172139 -1.930558 -0.103119
H  -1.153159 1.640161 0.114657
H  -3.087368 -3.265049 -0.33486
H  5.088057 0.935364 -1.487642
H  4.759199 -0.709078 -2.178815
H  6.282297 -0.407016 -1.251002
H  5.170448 3.047542 1.184524
H  5.158864 1.243654 1.367798
H  3.967904 2.260402 2.27903
H  3.167159 -3.277338 1.770868
H  4.551408 -2.683722 0.761381
H  3.795919 -4.295677 0.418323
H  -6.001329 1.161058 -0.022301
H  -6.596042 -0.540229 -0.183592
