program: Gaussian 09
title: 000292717
version: EM64L-G09RevD.01
frameworkgroup: C1[X(C14H14N2OS)]
method: RPBEPBE
basis: SDD
operation: Freq
keyword: #p
keyword: freq=noraman
keyword: PBEPBE/SDD
title: #p freq=noraman PBEPBE/SDD
converged: YES YES NO NO
title: Mulliken charges:
elementType: S O N N C C C C C C C C C C C C C C H H H H H H H H H H H H H H
charge: -0.041180 -0.238961 -0.033453 -0.049749 -0.361590 -0.358733 -0.303212 -0.304100 -0.387534 0.180250 0.425373 -0.098764 -0.266531 -0.312152 -0.389703 -0.321729 -0.246067 -0.220826 0.261322 0.236123 0.236833 0.255407 0.226777 0.195788 0.208896 0.227650 0.269449 0.245448 0.236889 0.261725 0.232288 0.234066
chargesum: 0.00000
title: Mulliken charges with hydrogens summed into heavy atoms:
elementType: S O N N C C C C C C C C C C C C C C
charge: -0.041180 -0.238961 -0.033453 -0.049749 0.135855 0.133507 0.119353 0.132446 -0.387534 0.180250 0.425373 -0.098764 0.002918 -0.066704 -0.152814 -0.060004 -0.013779 0.013240
polarizability: 2.91819804e+02 -3.19089810e+01 1.93618573e+02 1.19751346e+01 1.88327966e+01 1.18484300e+02
1716.lowfreq: -3.5237 -0.0008 0.0010 0.0010 5.5999 8.3460 34.1185 45.9123 54.0415
frequency: 34.1018 45.7874 53.9477 65.6773 128.0146 164.8464 181.5738 206.2819 231.9268 288.4660 315.5267 321.1758 382.7314 393.2491 418.2012 433.1098 452.3913 480.1965 497.5055 516.8235 527.0987 561.7069 603.0426 611.3904 637.9436 694.2448 752.8293 766.6782 787.9699 799.5482 807.4412 825.0621 844.1788 864.1198 888.2251 896.2675 925.5117 964.8027 985.1787 996.9197 1005.9780 1010.1164 1016.9723 1026.6299 1047.2458 1071.0817 1103.9534 1111.8603 1146.8078 1159.5017 1168.0975 1189.0478 1209.4980 1232.9793 1246.7994 1256.8710 1270.4687 1281.0019 1291.4850 1320.7954 1338.3130 1344.9850 1355.3083 1366.9170 1405.6078 1415.6316 1437.2276 1444.9011 1447.5212 1452.0190 1456.9767 1478.2066 1500.1496 1542.4326 1587.8026 1621.3883 2950.3780 2963.6918 2991.4237 3010.6815 3069.1875 3083.3568 3091.7756 3123.6867 3133.1665 3135.3110 3138.6216 3155.6493 3170.4110 3180.5875
redmass: 4.9089 4.1876 5.4864 4.2781 5.6596 3.5658 3.9831 3.9497 5.6482 3.4353 5.3994 3.3176 2.7368 3.7088 3.4623 3.4099 3.0493 2.9732 5.2270 7.0534 3.6572 3.8835 5.3591 4.5006 3.3492 3.1333 5.3148 1.3997 4.6547 3.1523 4.3832 1.7258 1.5536 4.1308 1.7054 2.7899 4.4466 1.3596 1.3803 1.3358 2.8593 2.4746 2.3086 3.8168 2.1465 4.1032 2.2255 1.8349 1.2143 2.8696 1.1399 1.1011 1.8764 1.7996 1.6118 1.5127 1.4414 1.9273 2.3879 1.2901 1.2343 1.3392 4.2169 1.2677 4.7796 2.1786 1.6219 1.2082 1.1156 1.8507 1.1035 2.2365 3.5716 7.0523 6.4498 6.5166 1.0680 1.0676 1.0605 1.0682 1.1014 1.0962 1.0983 1.0872 1.0945 1.0905 1.0890 1.0947 1.0999 1.0959
irintensity: 0.9279 1.4233 2.8240 1.6377 1.1214 3.7946 5.8809 6.7598 1.7441 10.0664 9.2765 2.1607 3.2915 1.7780 5.0382 3.6654 1.3484 7.7949 12.6279 0.4270 1.0846 7.2357 0.7155 9.8179 4.6329 3.0215 2.2699 48.8336 14.6085 1.4983 19.5462 0.7500 59.8074 9.7401 5.8427 0.5188 9.9304 2.6228 1.7072 0.0478 25.1365 11.3847 7.6823 61.1070 12.4403 26.5216 3.5541 9.3834 5.7898 24.9671 0.7808 9.1054 92.2645 36.5963 18.4331 35.6332 1.6731 41.8105 16.1851 1.3365 3.4769 7.9198 4.3551 1.0174 0.9780 24.6695 77.3419 29.0438 1.0523 10.5399 6.6967 94.8582 16.9535 19.7683 11.8692 2.5883 47.2517 50.3000 40.5461 31.5671 15.6318 29.1509 34.7188 3.3361 6.6890 7.3424 12.1442 24.2408 26.1609 2.7881
temp: 298.150 k
press: 1.00000 atm
elementType: 16 8 7 7 6 6 6 6 6 6 6 6 6 6 6 6 6 6 1 1 1 1 1 1 1 1 1 1 1 1 1 1
symmnumber: 1
zpe: 663402.3 jmol-1
zpe.correction: 0.252677 hartree
zpe.thermalcorrener: 0.267568 hartree
zpe.thermalcorrenthalpy: 0.268512 hartree
zpe.thermalcorrgfe: 0.209366 hartree
zpe.sumelectzpe: -1123.382899 hartree
zpe.sumelectthermal: -1123.368008 hartree
zpe.sumelectthermalent: -1123.367064 hartree
zpe.sumelectthermalfe: -1123.426210 hartree
dipole: 2.3985 -2.2466 1.8489
dipole: 3.7707
quadrupole: -98.9921 -118.0474 -111.3667
quadrupole: -1.8067 4.5038 8.2940
quadrupole: 10.4766 -8.5787 -1.8979 -1.8067 4.5038 8.2940
hfenergy: -1123.6355759 hartree
pointgroup: C01 [X(C14H14N2O1S1)]
dipole: -0.936668 -1.1472707 -0.0852451 debye
polarizability: 291.5851299|34.0373341|150.7432662|-7.5277722|-41.4092664|161.5942817 unknown
InChI: InChI=1S/C14H14N2OS/c18-14(16-7-9-17-10-8-16)13-6-5-11-3-1-2-4-12(11)15-13/h1-6H,7-10H2
charge 0 multiplicity 1
32 atoms
S  1.976634 2.551552 -1.156549
O  4.411826 -1.785469 0.430062
N  2.309081 0.202475 0.216905
N  -0.622857 0.179925 0.433488
C  1.997251 -1.1883 0.642467
C  3.697704 0.592579 0.569662
C  3.042894 -2.156258 0.046673
C  4.701248 -0.413235 -0.024453
C  1.480443 1.034755 -0.488481
C  0.029975 0.663408 -0.650321
C  -2.721439 0.154568 -0.900334
C  -1.986576 -0.061508 0.329507
C  -0.625064 0.914759 -1.907002
C  -1.985915 0.647547 -2.029472
C  -4.123284 -0.129319 -0.935594
C  -2.68014 -0.5484 1.483438
C  -4.776502 -0.607974 0.20414
C  -4.05027 -0.817904 1.420077
H  0.983849 -1.466936 0.32693
H  2.030245 -1.231437 1.747615
H  3.780544 0.594404 1.674004
H  3.880253 1.610761 0.185586
H  2.888585 -3.173879 0.441727
H  2.950479 -2.172533 -1.061473
H  4.670536 -0.366582 -1.133833
H  5.723287 -0.194774 0.324448
H  -0.036535 1.325348 -2.730735
H  -2.504798 0.818131 -2.979703
H  -4.67842 0.035662 -1.86693
H  -2.103253 -0.695027 2.401868
H  -5.850096 -0.823444 0.173154
H  -4.577284 -1.190696 2.305126
