program: Gaussian 09
title: 000292727
version: EM64L-G09RevD.01
frameworkgroup: C1[X(C16H32)]
method: RPBEPBE
basis: SDD
operation: Freq
keyword: #p
keyword: freq=noraman
keyword: PBEPBE/SDD
title: #p freq=noraman PBEPBE/SDD
converged: YES YES NO NO
title: Mulliken charges:
elementType: C C C C C C C C C C C C C C C C H H H H H H H H H H H H H H H H H H H H H H H H H H H H H H H H
charge: -0.357186 -0.373825 -0.389119 -0.365160 -0.468935 -0.353833 -0.555229 -0.389559 0.433933 -0.334993 -0.330930 -0.354551 -0.346043 -0.833145 -0.696663 -0.696791 0.183024 0.208118 0.188441 0.185733 0.198994 0.192291 0.184094 0.188475 0.197130 0.203434 0.186049 0.187653 0.199913 0.208107 0.195877 0.196297 0.213631 0.200323 0.182254 0.194254 0.194602 0.191200 0.190628 0.228327 0.223869 0.222221 0.209374 0.209782 0.214600 0.209059 0.214637 0.209637
chargesum: 0.00000
title: Mulliken charges with hydrogens summed into heavy atoms:
elementType: C C C C C C C C C C C C C C C C
charge: 0.033956 0.000350 0.002166 0.007409 -0.068372 0.019870 -0.147209 0.002616 0.433933 -0.121362 0.051646 0.034304 0.035786 -0.158727 -0.062907 -0.063458
polarizability: 1.95410159e+02 -2.49577367e+00 1.83037484e+02 -5.65995974e+00 7.13944007e+00 1.48431226e+02
1716.lowfreq: -0.0007 -0.0007 -0.0004 1.8185 3.5010 8.3313 20.4919 25.3111 37.5076
frequency: 20.2069 24.2424 37.4094 41.1000 51.4114 63.6893 68.8484 77.1652 89.0408 112.7756 120.6245 127.1697 136.4637 154.5469 176.8687 208.7492 225.9597 229.4848 236.3721 252.6629 289.9395 324.4463 347.6268 384.9112 397.7593 419.2948 457.7077 482.4312 502.0919 557.1789 719.6344 722.3964 727.1938 746.6560 753.5623 791.2490 812.2396 832.8871 848.0383 883.3374 887.1611 896.2849 918.0801 918.5257 953.6137 973.5491 982.5239 998.5551 1012.6635 1032.1415 1034.9122 1038.5153 1048.0759 1065.4008 1080.0298 1081.8048 1087.8570 1105.6008 1106.9935 1115.6027 1135.6788 1178.9861 1191.2486 1197.4916 1211.3834 1219.0174 1234.7256 1238.3124 1265.3296 1268.3118 1275.7540 1277.3091 1281.0586 1287.5410 1289.1610 1292.1125 1309.3970 1314.6582 1318.2751 1334.2422 1342.6823 1353.2429 1354.4261 1356.2188 1369.9612 1387.9595 1389.9272 1393.1848 1452.7340 1457.8898 1458.9155 1459.6476 1462.8695 1464.1532 1466.9766 1468.3336 1473.1933 1474.1117 1475.7702 1476.3994 1477.1988 1481.8358 1483.2918 1487.4328 1489.7148 1685.4148 2945.8482 2948.8422 2949.5042 2952.3436 2954.4532 2956.7054 2959.9956 2962.1876 2963.7932 2966.0496 2967.7072 2968.4865 2971.0788 2971.4774 2981.1238 2991.8180 2994.5679 3000.1779 3007.4219 3011.5023 3020.7894 3025.8152 3031.1365 3031.9546 3037.5261 3040.8132 3061.7337 3063.5431 3067.3449 3069.6501 3069.9039 3092.8893
redmass: 3.8414 3.0674 1.7377 3.0968 2.7714 2.6403 1.6344 3.3648 1.6948 2.0654 2.5687 1.2634 1.7232 2.5900 2.8612 2.2446 1.4392 1.1174 1.8400 2.7003 2.6801 2.3473 2.9324 2.5704 2.3613 3.0873 2.8584 2.6894 2.3349 2.1539 1.0642 1.1573 1.0966 1.6673 1.1583 1.5088 1.2582 1.5277 1.8151 1.6934 1.5560 1.6900 1.7357 1.4021 1.5202 2.2838 1.8332 1.5778 2.0442 1.8195 1.5853 2.2797 2.6320 2.6217 2.0896 2.1669 2.2445 1.8614 1.6214 2.2450 2.1501 1.5912 1.5618 1.4375 1.4022 1.5709 1.5515 1.3289 1.2844 1.2577 1.2597 1.2491 1.0309 1.0768 1.1587 1.0781 1.2829 1.3540 1.4332 1.4467 1.4541 1.6920 1.6015 1.5842 1.3972 1.2191 1.2176 1.3085 1.0790 1.0885 1.0777 1.0703 1.0784 1.0788 1.0725 1.0756 1.0617 1.0715 1.0713 1.0513 1.0422 1.0679 1.0882 1.0867 1.0899 6.8250 1.0590 1.0609 1.0591 1.0603 1.0596 1.0595 1.0605 1.0529 1.0493 1.0591 1.0608 1.0366 1.0387 1.0573 1.0962 1.0972 1.0962 1.0995 1.1010 1.1030 1.1001 1.1006 1.0966 1.1001 1.1028 1.1029 1.0902 1.1000 1.1007 1.0994 1.0994 1.0953
irintensity: 0.0029 0.0062 0.0118 0.0111 0.0650 0.0805 0.0167 0.0756 0.0726 0.2987 0.0316 0.4411 0.0603 0.4119 0.0918 0.3240 0.1162 0.0013 0.3382 0.0295 0.3643 0.5796 0.8722 0.2821 1.2982 0.0563 0.1221 3.5073 0.2945 6.5135 15.3318 7.0106 0.6914 1.3251 4.1123 0.9460 2.9938 6.2562 2.9360 4.7349 3.6493 3.9992 17.9140 3.4251 0.3294 0.5204 3.2766 2.7317 0.4721 2.6641 1.6382 4.2110 1.7241 0.3369 0.6622 2.1197 2.0349 6.2212 5.6980 10.9682 4.5440 2.9996 2.9086 0.7149 1.3728 2.3478 1.4249 1.2611 0.4795 0.5629 0.9795 0.5446 0.5577 0.4741 0.1775 0.7479 0.5710 0.1871 0.9691 0.9344 0.4722 0.5678 2.7173 1.7048 0.1923 8.9459 11.5385 21.7200 1.7362 8.1929 0.2311 1.8355 1.3883 7.6036 3.3572 0.7563 25.0259 6.8233 2.4178 9.8377 12.7823 1.8382 2.0163 3.3151 35.0189 2.1606 2.4887 37.6196 0.6011 5.7260 8.4055 3.4251 27.2304 33.7629 5.0119 61.6740 216.6882 36.9783 71.3713 69.8705 0.0789 1.9655 1.3983 4.5270 9.9797 6.2902 20.9759 11.9997 33.4937 15.3290 95.6804 163.6047 37.6932 125.2195 95.8680 1.5392 109.1579 34.8006
temp: 298.150 k
press: 1.00000 atm
elementType: 6 6 6 6 6 6 6 6 6 6 6 6 6 6 6 6 1 1 1 1 1 1 1 1 1 1 1 1 1 1 1 1 1 1 1 1 1 1 1 1 1 1 1 1 1 1 1 1
symmnumber: 1
zpe: 1157954.8 jmol-1
zpe.correction: 0.441042 hartree
zpe.thermalcorrener: 0.462930 hartree
zpe.thermalcorrenthalpy: 0.463874 hartree
zpe.thermalcorrgfe: 0.386987 hartree
zpe.sumelectzpe: -627.546795 hartree
zpe.sumelectthermal: -627.524906 hartree
zpe.sumelectthermalent: -627.523962 hartree
zpe.sumelectthermalfe: -627.600849 hartree
dipole: -0.0965 0.1380 0.2197
dipole: 0.2768
quadrupole: -107.5736 -104.3758 -103.0292
quadrupole: -2.5458 -0.3172 -0.8973
quadrupole: -2.5807 0.6171 1.9637 -2.5458 -0.3172 -0.8973
hfenergy: -627.9878367 hartree
pointgroup: C01 [X(C16H32)]
dipole: -0.0413216 -0.0573758 -0.0828427 debye
polarizability: 195.7577245|2.4477023|183.5086921|4.9604598|5.0494162|147.6124522 unknown
InChI: InChI=1S/C16H32/c1-4-6-8-9-10-11-13-15-16(3)14-12-7-5-2/h15H,4-14H2,1-3H3
charge 0 multiplicity 1
48 atoms
C  0.508777 1.719459 -0.198439
C  1.980682 1.621594 0.259852
C  -0.285597 2.84201 0.504707
C  2.748369 0.461417 -0.41441
C  -1.784801 2.891786 0.085592
C  4.221097 0.34791 0.038629
C  -3.894187 -0.457672 0.446746
C  -3.285632 -1.848811 0.100542
C  -3.18792 0.722861 -0.218879
C  -2.558379 1.668627 0.538853
C  -1.80965 -1.997958 0.528684
C  4.97754 -0.823428 -0.629206
C  -1.209295 -3.383931 0.20032
C  -3.249174 0.743535 -1.736931
C  6.448578 -0.932015 -0.172926
C  0.274036 -3.505745 0.612707
H  0.474796 1.880844 -1.296914
H  0.002225 0.751056 -0.011329
H  2.012787 1.488331 1.361769
H  2.501033 2.579499 0.048085
H  0.184153 3.822839 0.284822
H  -0.220379 2.702197 1.604118
H  2.224727 -0.494312 -0.197236
H  2.712275 0.590142 -1.516759
H  -1.846531 3.023221 -1.011268
H  -2.24252 3.796515 0.538042
H  4.749462 1.298661 -0.184733
H  4.258325 0.224487 1.141462
H  -4.963033 -0.463478 0.143268
H  -3.874252 -0.325757 1.546659
H  -3.374451 -2.03801 -0.988819
H  -3.893668 -2.631696 0.598687
H  -2.585185 1.533464 1.63329
H  -1.203638 -1.211249 0.035089
H  -1.724373 -1.809002 1.619682
H  4.938238 -0.700157 -1.731012
H  4.448344 -1.772337 -0.404482
H  -1.308177 -3.574548 -0.888283
H  -1.80257 -4.172147 0.708021
H  -2.703737 -0.118086 -2.170367
H  -2.818323 1.660651 -2.169633
H  -4.298047 0.66104 -2.084572
H  7.007553 -0.007791 -0.413394
H  6.51334 -1.086554 0.920869
H  6.965313 -1.776993 -0.664523
H  0.890613 -2.74455 0.096669
H  0.685905 -4.501007 0.363055
H  0.396046 -3.351515 1.701593
