program: Gaussian 09
title: 000292706
version: EM64L-G09RevD.01
frameworkgroup: C1[X(C12H13NO2S)]
method: RPBEPBE
basis: SDD
operation: Freq
keyword: #p
keyword: freq=noraman
keyword: PBEPBE/SDD
title: #p freq=noraman PBEPBE/SDD
converged: YES YES NO NO
title: Mulliken charges:
elementType: S O O N C C C C C C C C C C C C H H H H H H H H H H H H H
charge: 0.016965 -0.238481 -0.211998 -0.012532 -0.356411 -0.364691 -0.301821 -0.298079 -0.407690 0.110383 0.328123 -0.322460 -0.352092 -0.232683 -0.227266 -0.226257 0.243966 0.254356 0.251474 0.247230 0.203841 0.232484 0.232132 0.197820 0.256450 0.276442 0.232095 0.234467 0.234233
chargesum: 0.00000
title: Mulliken charges with hydrogens summed into heavy atoms:
elementType: S O O N C C C C C C C C C C C C
charge: 0.016965 -0.238481 -0.211998 -0.012532 0.141910 0.134013 0.134504 0.131873 -0.407690 0.110383 0.328123 -0.066010 -0.075650 -0.000588 0.007201 0.007976
polarizability: 2.09933362e+02 1.65765167e+01 1.37726762e+02 3.77146225e+00 -8.42963362e+00 1.43899259e+02
1716.lowfreq: -13.0477 -8.8511 -0.8988 0.0011 0.0014 0.0015 15.6344 40.5066 53.4342
frequency: 14.1844 40.4325 53.3395 63.2777 128.1418 144.6586 158.5338 198.2060 227.8659 260.1380 307.0977 311.7265 379.7975 397.7828 401.9349 437.4921 440.2814 462.6857 506.5393 606.6368 612.4329 631.3710 672.2224 686.2415 698.4992 781.9743 797.6846 813.1934 824.1488 856.0726 892.2691 933.3195 946.2057 987.2743 990.7737 1007.8408 1008.5112 1015.5505 1023.1923 1043.4699 1069.7863 1080.4276 1093.4242 1106.0712 1173.5104 1175.4649 1184.7772 1190.9535 1222.0840 1259.3005 1271.7001 1281.5255 1317.2846 1326.4485 1338.4255 1347.4162 1366.9835 1389.2409 1434.6757 1444.5238 1446.0874 1447.8365 1455.6515 1475.6993 1478.9191 1526.1769 1588.7853 1606.7773 2951.1180 2961.3598 2991.5947 3005.4282 3065.9073 3089.6941 3094.6239 3107.3968 3129.7803 3140.0011 3150.1150 3159.8682 3170.0420
redmass: 6.0125 4.0983 3.4051 5.0143 6.6724 7.3447 4.6669 3.8617 3.6639 4.2523 5.1985 3.7989 3.1400 2.7576 2.7999 3.9268 4.1892 3.1227 5.0376 2.3634 6.3695 7.8575 5.4347 4.2119 1.6644 3.2231 2.9650 4.1271 1.7116 1.2523 2.9780 2.9624 1.6231 2.3155 2.2076 1.4047 2.2890 2.6230 2.2918 2.1786 3.5768 1.9240 3.2572 2.2090 1.2855 1.8332 1.1449 1.1772 1.6308 1.4156 1.5221 1.8555 1.3563 1.2701 1.2355 1.3488 1.2642 9.2850 2.3080 1.1093 1.3491 1.0834 1.1051 2.1772 2.4355 10.0124 6.3631 5.9939 1.0684 1.0681 1.0601 1.0657 1.1017 1.0957 1.0979 1.0975 1.0852 1.0881 1.0924 1.0963 1.1014
irintensity: 0.6415 0.9002 1.2985 3.3295 1.2362 2.3987 0.4893 17.3937 3.0398 6.4962 8.6544 4.6870 4.7704 0.1660 0.8117 2.1541 2.5800 2.0609 19.5730 9.3399 0.5155 15.7908 17.4031 0.2295 80.8664 13.0302 32.3934 7.1980 1.7239 1.9517 2.4111 47.4428 12.0726 1.2786 1.4735 2.5825 8.5326 33.5729 9.7116 26.6897 22.6231 28.5220 9.1960 1.8566 7.6966 3.9647 40.0486 0.6092 219.6730 68.5260 51.7800 47.8358 8.6274 4.8649 3.7413 2.3018 0.4786 5.8555 14.9291 36.8905 82.4418 1.6736 7.4537 24.6361 79.9336 177.6107 5.5903 14.6581 42.7123 49.0236 33.4823 29.5790 11.1122 28.2810 30.2711 9.6958 0.0618 6.0296 11.4840 17.1497 24.9524
temp: 298.150 k
press: 1.00000 atm
elementType: 16 8 8 7 6 6 6 6 6 6 6 6 6 6 6 6 1 1 1 1 1 1 1 1 1 1 1 1 1
symmnumber: 1
zpe: 597414.4 jmol-1
zpe.correction: 0.227543 hartree
zpe.thermalcorrener: 0.241998 hartree
zpe.thermalcorrenthalpy: 0.242942 hartree
zpe.thermalcorrgfe: 0.183722 hartree
zpe.sumelectzpe: -1067.146056 hartree
zpe.sumelectthermal: -1067.131602 hartree
zpe.sumelectthermalent: -1067.130658 hartree
zpe.sumelectthermalfe: -1067.189877 hartree
dipole: 0.0570 -3.5071 -1.9937
dipole: 4.0345
quadrupole: -89.7647 -109.3528 -101.0248
quadrupole: 9.4789 2.1599 -2.1627
quadrupole: 10.2827 -9.3054 -0.9774 9.4789 2.1599 -2.1627
hfenergy: -1067.3735994 hartree
pointgroup: C01 [X(C12H13N1O2S1)]
dipole: -0.0067707 -1.5872402 0.0125186 debye
polarizability: 210.7441354|14.8450706|131.4020412|-3.2564654|-0.9865789|149.4132072 unknown
InChI: InChI=1S/C12H13NO2S/c14-11(10-4-2-1-3-5-10)12(16)13-6-8-15-9-7-13/h1-5H,6-9H2
charge 0 multiplicity 1
29 atoms
S  0.553991 1.925212 -1.819163
O  3.85812 -1.600392 0.471115
O  -0.526496 1.646739 1.594804
N  1.822986 0.412517 0.101694
C  3.129164 0.527606 -0.591946
C  1.900032 -0.357217 1.371546
C  3.73312 -0.87319 -0.804305
C  2.538512 -1.736542 1.103806
C  0.690297 1.003115 -0.374729
C  -0.554643 0.988834 0.50645
C  -1.768316 0.241801 0.058643
C  -1.761732 -0.613791 -1.076264
C  -2.949292 0.353535 0.843593
C  -2.917918 -1.345955 -1.416654
C  -4.104728 -0.372584 0.496013
C  -4.091443 -1.225696 -0.634709
H  3.804326 1.139556 0.037323
H  2.965903 1.048563 -1.551707
H  0.896806 -0.473827 1.808639
H  2.521971 0.213129 2.087732
H  3.102123 -1.4544 -1.510371
H  4.757056 -0.79794 -1.203642
H  2.716162 -2.269269 2.051942
H  1.867065 -2.343544 0.458113
H  -0.864148 -0.684098 -1.699269
H  -2.931805 1.015266 1.716042
H  -2.911177 -2.001165 -2.294411
H  -5.01387 -0.277088 1.09945
H  -4.990369 -1.790577 -0.906132
