program: Gaussian 09
title: 000292703
version: EM64L-G09RevD.01
frameworkgroup: C1[X(C14H10BrNO2)]
method: RPBEPBE
basis: SDD
operation: Freq
keyword: #p
keyword: freq=noraman
keyword: PBEPBE/SDD
title: #p freq=noraman PBEPBE/SDD
converged: YES YES NO YES
title: Mulliken charges:
elementType: Br O O N C C C C C C C C C C C C C C H H H H H H H H H H
charge: -0.004378 -0.261601 -0.254732 -0.110934 0.219353 0.177234 0.505817 -0.487437 -0.333229 -0.376046 -0.202674 -0.406927 0.321763 -0.374412 -0.374387 -0.160912 -0.160943 -0.227633 0.299078 0.256548 0.236623 0.242851 0.242855 0.233850 0.251169 0.251163 0.248973 0.248969
chargesum: 0.00000
title: Mulliken charges with hydrogens summed into heavy atoms:
elementType: Br O O N C C C C C C C C C C C C C C
charge: -0.004378 -0.261601 -0.254732 -0.110934 0.219353 0.177234 0.505817 -0.188359 -0.076681 -0.139423 0.283032 -0.173077 0.321763 -0.123243 -0.123224 0.088061 0.088026 -0.227633
polarizability: 3.74380145e+02 -7.78171942e-01 1.26464766e+02 6.78000731e-03 3.01466784e-02 1.12931445e+02
1716.lowfreq: -66.5805 -5.3783 -1.2301 -0.0003 0.0008 0.0009 4.0248 29.4107 30.4265
frequency: -66.5276 29.4048 30.3905 36.4752 75.0746 91.9915 143.6740 178.9312 209.7373 230.5698 243.1570 328.2862 345.0468 352.1292 400.2290 419.0107 439.1409 460.8349 504.8911 528.6525 592.5549 608.8123 625.1762 641.0165 680.6301 703.4619 725.8259 761.7008 782.3408 809.8330 813.5850 815.4646 832.2601 840.1823 908.8713 932.1860 933.2124 940.2136 954.7349 978.0953 984.1969 988.8997 1057.7833 1060.5486 1065.6858 1103.7300 1119.5720 1126.9394 1163.9853 1181.3835 1203.6691 1256.7779 1264.0878 1286.3206 1345.7112 1356.4026 1368.3969 1393.8804 1412.1404 1454.3493 1466.1851 1480.1966 1487.8831 1564.7893 1590.1774 1601.7474 1624.6008 1636.9556 2957.5531 3018.3604 3097.6799 3137.3999 3147.9730 3148.4308 3168.1832 3172.0528 3184.2536 3186.4703
redmass: 4.2621 9.1208 7.7639 2.3707 5.6028 8.0303 9.8053 4.2332 6.7478 6.0818 8.4270 9.0870 4.6545 6.2805 3.0860 3.2709 4.6085 4.8342 5.7594 3.5355 6.2686 4.5063 6.6511 7.8261 9.5300 3.6742 4.4350 5.9591 5.6402 3.0740 1.3296 1.2566 2.4076 9.1748 1.3662 3.2117 1.3525 1.4195 1.3525 4.5838 1.5980 4.7796 2.5242 3.6624 1.4546 1.3470 1.0367 1.5904 1.8679 1.2347 2.3297 1.3256 3.6739 1.2505 5.1171 1.8521 1.4029 3.8960 2.5392 3.6147 2.5918 3.1953 1.2512 7.7725 6.3151 8.2382 7.7186 8.7381 1.0881 1.0535 1.1190 1.0903 1.0885 1.0882 1.0966 1.0976 1.0940 1.0950
irintensity: 2.0498 0.0436 0.1239 15.6240 1.9158 0.7213 1.3954 3.1944 0.6523 0.0008 0.8621 10.2388 2.2331 3.2662 0.6945 11.5075 18.0342 0.0337 6.1727 17.6938 0.7917 10.0713 0.4482 58.7147 0.5661 3.3214 2.3754 22.8551 2.7768 15.9986 36.2020 6.3163 88.8207 10.9796 14.9135 30.5487 5.4029 2.5799 0.0102 166.2369 18.4082 57.4179 29.4271 50.1990 4.2809 9.1862 0.0068 0.8348 121.5247 2.3788 175.1211 6.5525 271.0712 0.0842 2.5192 38.3783 21.9001 0.8805 31.0781 290.9371 14.0568 123.3109 24.9496 0.7095 28.9736 122.3651 52.6954 439.3865 39.3731 132.6513 28.3832 7.2642 0.7176 8.1864 11.4981 0.1495 0.9069 8.5413
temp: 298.150 k
press: 1.00000 atm
elementType: 35 8 8 7 6 6 6 6 6 6 6 6 6 6 6 6 6 6 1 1 1 1 1 1 1 1 1 1
symmnumber: 1
zpe: 531100.9 jmol-1
zpe.correction: 0.202286 hartree
zpe.thermalcorrener: 0.216899 hartree
zpe.thermalcorrenthalpy: 0.217843 hartree
zpe.thermalcorrgfe: 0.157347 hartree
zpe.sumelectzpe: -756.855521 hartree
zpe.sumelectthermal: -756.840908 hartree
zpe.sumelectthermalent: -756.839963 hartree
zpe.sumelectthermalfe: -756.900459 hartree
dipole: 4.6436 1.4051 -0.0017
dipole: 4.8516
quadrupole: -105.9545 -111.5973 -107.6310
quadrupole: -3.7468 0.0031 0.0144
quadrupole: 2.4398 -3.2030 0.7633 -3.7468 0.0031 0.0144
hfenergy: -757.0578065 hartree
pointgroup: C01 [X(C14H10Br1N1O2)]
dipole: 1.8235356 0.5639557 0.0011407 debye
polarizability: 374.3803921|0.7377219|126.4641729|0.0016091|0.0747802|112.9317903 unknown
InChI: InChI=1S/C14H10BrNO2/c15-11-2-4-12(5-3-11)16-8-10-1-6-13-14(7-10)18-9-17-13/h1-8H,9H2
charge 0 multiplicity 1
28 atoms
Br -7.181695 -0.129399 -0.000132
O  4.151555 -1.773434 -0.004219
O  5.435773 0.256418 0.00051
N  -0.974659 -0.311486 -0.000654
C  3.29371 -0.646714 -0.001582
C  4.056725 0.548099 0.001205
C  1.266541 0.643949 0.001478
C  1.905059 -0.638164 -0.001537
C  3.456346 1.809532 0.004167
C  2.03753 1.837507 0.004251
C  5.534899 -1.232192 -0.003039
C  -0.202151 0.741831 0.001749
C  -2.392104 -0.213618 -0.000445
C  -3.111735 -0.206431 -1.226013
C  -3.111634 -0.209661 1.225198
C  -4.523155 -0.179459 -1.228874
C  -4.523055 -0.18271 1.228251
C  -5.214757 -0.16608 -0.000262
H  1.298877 -1.547107 -0.003665
H  4.052518 2.724905 0.006305
H  1.524296 2.805997 0.006546
H  6.051358 -1.552371 -0.923912
H  6.051505 -1.556751 0.916214
H  -0.620004 1.77082 0.004041
H  -2.563457 -0.230445 -2.173245
H  -2.563278 -0.236179 2.17232
H  -5.070692 -0.16865 -2.17595
H  -5.070516 -0.174409 2.175397
