program: Gaussian 09
title: 000028089
version: EM64L-G09RevD.01
frameworkgroup: C1[X(C13H22N2O)]
method: RPBEPBE
basis: SDD
operation: Freq
keyword: #p
keyword: freq=noraman
keyword: PBEPBE/SDD
title: #p freq=noraman PBEPBE/SDD
converged: NO YES NO NO
title: Mulliken charges:
elementType: O N N C C C C C C C C C C C C C H H H H H H H H H H H H H H H H H H H H H H
charge: -0.277193 -0.061811 -0.377443 -0.399226 -0.394260 -0.391477 -0.364783 -0.369986 -0.403594 -0.032306 -0.018574 -0.503656 -0.423339 -0.349153 0.260210 -0.683038 0.189428 0.214447 0.206348 0.195392 0.192615 0.206686 0.237527 0.167532 0.169697 0.211116 0.213272 0.233812 0.200020 0.228607 0.203268 0.242480 0.248565 0.280371 0.310175 0.206001 0.210094 0.222177
chargesum: 0.00000
title: Mulliken charges with hydrogens summed into heavy atoms:
elementType: O N N C C C C C C C C C C C C C
charge: -0.277193 -0.061811 -0.067268 0.004648 0.007480 0.007825 0.040276 0.010827 0.043490 -0.032306 -0.018574 -0.075029 0.105598 0.096595 0.260210 -0.044767
polarizability: 2.04479064e+02 4.05212205e+00 1.42403399e+02 1.25769975e+01 1.01548599e+00 1.28010855e+02
1716.lowfreq: -7.1344 -2.8966 -0.0009 -0.0008 -0.0007 3.2937 8.7692 24.1198 28.5483
frequency: 8.3710 13.6441 26.8341 34.0539 59.3073 70.8141 81.4126 123.1561 172.9811 206.6429 218.2454 234.3188 236.7888 252.8324 270.1535 291.3153 314.0699 333.6419 357.5706 382.5167 395.8837 452.2823 473.1715 527.0355 554.6911 583.4722 594.9496 700.9926 746.4156 751.8797 792.1151 806.9358 850.9419 857.0726 866.9159 882.1795 910.4933 912.0909 959.8972 977.3173 989.3881 1004.9836 1035.9879 1045.6570 1058.1520 1079.0470 1093.8899 1097.4112 1112.9293 1123.3702 1146.0124 1152.6336 1172.4121 1194.5869 1201.8298 1221.5291 1236.2117 1248.3910 1263.8327 1270.0664 1275.7859 1287.7147 1306.1391 1328.7226 1334.9093 1338.1176 1341.6298 1348.3202 1354.0546 1363.5633 1387.5954 1390.9428 1447.6596 1451.1203 1453.1650 1461.1453 1467.4562 1467.5636 1468.8625 1475.8511 1477.5009 1479.0642 1479.5923 1486.3907 1613.2242 2284.6857 2809.1560 2814.3460 2829.8308 2965.8057 2967.3416 2971.9232 2974.3523 2985.7960 2988.8349 2992.6734 2995.4480 3013.4689 3026.2908 3028.6153 3034.7598 3044.3844 3047.9610 3049.3063 3056.7545 3074.5730 3076.6155 3560.8866
redmass: 3.7776 2.6139 3.4709 3.8756 3.5729 3.7490 2.1584 3.5847 2.8557 4.0086 2.8455 1.3607 1.7722 2.5970 3.4367 2.0503 3.7107 3.5065 4.8669 1.8258 3.3733 2.9319 2.8708 2.0462 1.7596 2.6315 2.3221 4.3941 1.1763 3.7376 3.8899 1.4757 2.2365 1.6026 1.3422 2.2722 2.1868 2.3425 1.2972 1.8312 2.5499 2.2678 3.1916 2.2434 2.5046 1.4000 1.8534 2.1470 2.3646 2.5710 2.3663 1.3260 2.9512 1.2863 1.6767 1.1162 1.3616 1.4157 1.2462 1.2635 1.2292 1.3775 1.2428 1.3020 1.3950 1.4081 1.4308 1.4930 1.6118 1.4338 1.4737 1.2147 1.1008 1.0883 1.0843 1.0873 1.4550 1.1185 1.0982 1.0491 1.2836 1.0497 1.0978 1.0821 6.5236 11.7402 1.0708 1.0716 1.0691 1.0638 1.0628 1.0387 1.0560 1.0626 1.0611 1.0638 1.0844 1.0863 1.0978 1.0947 1.0958 1.0886 1.1027 1.1003 1.1035 1.0988 1.1020 1.0783
irintensity: 0.1504 5.1215 3.2426 1.7575 0.5501 0.9781 1.0760 1.8508 0.8370 10.6714 8.9071 2.5763 4.8171 5.1125 3.2800 6.9806 3.9918 0.4069 0.0090 1.1519 6.9383 0.1348 4.7811 34.8737 69.8433 21.3682 17.7699 0.3817 10.1695 10.9790 1.5155 0.0458 3.7886 6.8774 2.2970 2.6618 2.0906 8.8341 2.7676 2.7333 22.9746 10.0548 0.8929 14.6962 2.4291 9.0810 25.4451 18.0635 7.3911 5.3413 2.8383 8.6407 21.8931 2.9212 49.6345 59.8574 31.9386 10.5955 2.1752 13.1943 15.0317 6.2585 9.0105 34.7292 14.3740 9.4457 1.0107 1.5725 17.9656 5.2732 8.2143 9.9368 11.5027 8.6922 1.1532 12.9352 176.1671 42.3331 13.2525 1.9168 84.5377 18.2306 5.9488 16.4487 177.0130 0.1703 28.8321 55.9737 228.3080 34.7990 39.4082 28.2428 22.8289 28.9235 31.8246 31.6501 12.4529 72.1047 13.4023 12.6926 62.6261 26.7535 12.6699 0.0677 95.0744 50.4053 76.3204 19.8426
temp: 298.150 k
press: 1.00000 atm
elementType: 8 7 7 6 6 6 6 6 6 6 6 6 6 6 6 6 1 1 1 1 1 1 1 1 1 1 1 1 1 1 1 1 1 1 1 1 1 1
symmnumber: 1
zpe: 866776.0 jmol-1
zpe.correction: 0.330138 hartree
zpe.thermalcorrener: 0.348244 hartree
zpe.thermalcorrenthalpy: 0.349189 hartree
zpe.thermalcorrgfe: 0.279234 hartree
zpe.sumelectzpe: -691.984308 hartree
zpe.sumelectthermal: -691.966201 hartree
zpe.sumelectthermalent: -691.965257 hartree
zpe.sumelectthermalfe: -692.035212 hartree
dipole: -2.3317 0.3098 -2.8893
dipole: 3.7256
quadrupole: -94.3221 -94.9557 -101.2481
quadrupole: 4.8510 -11.3736 3.2294
quadrupole: 2.5198 1.8863 -4.4061 4.8510 -11.3736 3.2294
hfenergy: -692.3144456 hartree
pointgroup: C01 [X(C13H22N2O1)]
dipole: -0.9227078 0.0658158 1.137009 debye
polarizability: 204.2883254|-7.3533262|142.7227666|-11.4364725|-0.8239612|127.8822251 unknown
InChI: InChI=1S/C13H22N2O/c1-2-8-13(16)14-9-4-7-12-15-10-5-3-6-11-15/h14H,2-3,5-6,8-12H2,1H3
charge 0 multiplicity 1
38 atoms
O  3.715821 0.205087 -1.638583
N  -2.989143 0.270916 0.301306
N  2.41849 0.813797 0.191509
C  -4.75983 -1.993851 -0.324989
C  -3.29318 -1.937238 -0.810813
C  -4.925519 -1.15278 0.962167
C  -2.825055 -0.477852 -0.972232
C  -4.405969 0.28335 0.748695
C  -2.450553 1.655366 0.218245
C  -1.00119 1.703934 -0.052364
C  0.207778 1.760815 -0.292552
C  4.030655 -1.039329 0.461106
C  1.655774 1.833362 -0.557818
C  5.569358 -1.086333 0.300548
C  3.391842 0.037095 -0.421928
C  6.200108 -2.277148 1.051092
H  -5.424522 -1.589277 -1.116664
H  -5.071023 -3.040374 -0.145947
H  -2.637805 -2.440058 -0.073885
H  -3.180376 -2.466241 -1.776539
H  -5.987527 -1.116166 1.27281
H  -4.34968 -1.618764 1.784906
H  -1.758608 -0.443776 -1.25716
H  -3.409582 0.010063 -1.798707
H  -5.063028 0.803122 -0.000754
H  -4.469718 0.85425 1.695016
H  -2.975047 2.259686 -0.570332
H  -2.656464 2.15497 1.185646
H  3.756782 -0.899766 1.525676
H  3.610873 -2.015905 0.145305
H  6.005533 -0.135829 0.665563
H  5.799213 -1.143143 -0.778946
H  2.026707 2.849999 -0.314002
H  1.886175 1.656447 -1.625879
H  2.163383 0.637856 1.164305
H  5.98954 -2.230245 2.13655
H  5.804556 -3.238908 0.672907
H  7.29763 -2.290933 0.922044
