program: Gaussian 09
title: 000292699
version: EM64L-G09RevD.01
frameworkgroup: C1[X(C9H11NOS2)]
method: RPBEPBE
basis: SDD
operation: Freq
keyword: #p
keyword: freq=noraman
keyword: PBEPBE/SDD
title: #p freq=noraman PBEPBE/SDD
converged: YES YES NO NO
title: Mulliken charges:
elementType: S S O N C C C C C C C C C H H H H H H H H H H H
charge: 0.228346 -0.034073 -0.240686 -0.054193 -0.384837 -0.351689 -0.295163 -0.303695 -0.289057 -0.061165 -0.229657 -0.126600 -0.501955 0.251297 0.243347 0.234741 0.257399 0.225255 0.203193 0.202625 0.228508 0.281050 0.248946 0.268064
chargesum: 0.00000
title: Mulliken charges with hydrogens summed into heavy atoms:
elementType: S S O N C C C C C C C C C
charge: 0.228346 -0.034073 -0.240686 -0.054193 0.109807 0.140452 0.133284 0.127437 -0.289057 -0.061165 0.051393 0.122346 -0.233891
polarizability: 1.82627844e+02 9.23470737e+00 1.59462261e+02 -4.99564237e+00 3.49561200e+00 8.56391208e+01
1716.lowfreq: 0.0008 0.0022 0.0025 2.9650 8.2384 16.0212 42.3353 56.1985 60.8538
frequency: 42.3042 56.1697 60.7137 113.0087 176.9368 196.5422 251.6275 280.7927 297.3973 318.9722 397.2497 415.4851 457.8796 470.2608 507.6083 550.0694 586.3521 623.9547 631.2376 680.9663 699.9515 773.7971 796.5455 828.5640 831.7446 844.3889 882.7792 918.8225 927.7303 1010.0325 1015.4275 1045.1975 1051.5747 1071.9441 1085.7600 1101.6824 1146.2160 1186.1625 1198.9776 1208.9431 1248.4790 1262.6904 1273.6900 1321.0727 1333.2750 1340.2471 1349.4609 1366.5200 1425.2774 1448.6368 1453.8775 1456.8700 1462.0213 1470.2878 1541.0006 2955.9869 2960.9146 2977.1316 2987.1680 3071.0742 3087.1932 3091.6395 3107.4386 3178.0634 3197.2282 3234.2970
redmass: 6.6907 5.3701 4.1583 4.8505 4.0838 5.3147 4.7681 3.7380 3.2742 4.8678 3.5368 2.2234 2.8249 5.4283 4.6972 3.9149 4.2265 2.9388 5.2796 6.6115 1.1783 5.1470 4.2983 2.6053 2.2478 1.3447 3.2696 1.3909 3.2672 2.5523 2.3396 2.1094 1.7416 3.7161 1.1832 2.1786 3.8305 1.1344 1.8284 1.4298 1.4153 2.1220 1.2175 1.2676 2.1505 1.2921 1.3730 1.2799 2.7711 1.0871 1.1181 1.1587 2.4650 1.5127 6.0214 1.0683 1.0682 1.0677 1.0634 1.0978 1.0966 1.0982 1.0934 1.0897 1.0975 1.1007
irintensity: 1.1262 0.9946 2.4383 0.6119 3.1840 3.9734 1.9156 10.1872 6.2597 3.9611 4.2503 1.5988 0.3398 2.1012 14.4155 0.4740 1.6180 18.3013 3.4062 1.2431 95.9102 20.2080 27.6707 1.4023 2.4768 20.3449 3.0816 1.2330 17.4325 28.3343 35.5884 43.3164 3.4269 33.9712 4.1569 6.8713 2.8126 5.5588 54.2585 57.6743 55.8756 94.1859 24.8585 2.5651 5.1456 0.7660 5.3655 0.4726 158.1079 7.7943 15.3883 10.6716 2.2461 36.9068 28.4944 35.0656 46.7813 40.1040 58.4022 14.3665 30.5468 34.1416 6.1816 6.2723 0.4502 0.4087
temp: 298.150 k
press: 1.00000 atm
elementType: 16 16 8 7 6 6 6 6 6 6 6 6 6 1 1 1 1 1 1 1 1 1 1 1
symmnumber: 1
zpe: 486541.0 jmol-1
zpe.correction: 0.185314 hartree
zpe.thermalcorrener: 0.197403 hartree
zpe.thermalcorrenthalpy: 0.198347 hartree
zpe.thermalcorrgfe: 0.145688 hartree
zpe.sumelectzpe: -1274.647093 hartree
zpe.sumelectthermal: -1274.635004 hartree
zpe.sumelectthermalent: -1274.634060 hartree
zpe.sumelectthermalfe: -1274.686719 hartree
dipole: -0.7068 -2.9979 1.0982
dipole: 3.2700
quadrupole: -85.3755 -97.2607 -91.0181
quadrupole: 8.7056 -3.2336 1.9349
quadrupole: 5.8426 -6.0426 0.2000 8.7056 -3.2336 1.9349
hfenergy: -1274.832407 hartree
pointgroup: C01 [X(C9H11N1O1S2)]
dipole: 0.2580753 1.2440845 0.202043 debye
dipolederiv: -0.1715388 0.0741253 -0.1760316 0.0978224 -0.0691224 0.1570417 -0.0739874 0.1796063 -0.0639212 -0.4626114 -0.089902 0.0315117 0.0727736 -0.8888938 0.0110919 0.0946601 0.0241533 -0.2251972 -0.6013476 -0.0671035 -0.1274339 -0.0288388 -0.6908301 -0.0443915 -0.1347525 -0.0376232 -0.4719553 -1.0376911 0.4875151 0.0337645 0.4224991 -0.8122666 -0.0038923 -0.2417767 0.16611 -0.2454736 -0.0179415 -0.0602171 -0.0905104 -0.2172747 0.4101577 0.1170485 -0.1095418 0.0500525 0.2385728 0.3039318 0.0881378 -0.0448117 0.3518172 -0.0828857 -0.0157481 -0.0965276 -0.0324514 0.1839056 0.571522 0.1589617 0.0657889 0.0962971 0.3286776 -0.0105703 0.112513 -0.0366518 0.324933 0.2680823 -0.0602247 -0.0211588 -0.1030043 0.6161345 0.1017416 0.1355847 0.0609262 0.3981404 1.4373049 -0.2641687 -0.1820378 -0.3516604 1.140825 0.0194162 -0.0593537 -0.0598321 -0.113654 -0.4765991 -0.1089014 0.1193718 -0.022017 0.1567082 -0.2739721 0.0241497 -0.2415124 0.136419 0.0166635 0.114577 -0.1114287 -0.0443502 -0.0763824 -0.0633785 -0.0783206 -0.056523 -0.1127599 0.0136502 0.0013968 0.0555135 0.0186802 -0.1744883 0.0520362 0.0522701 0.0638108 -0.1681428 0.0539225 -0.143845 0.242053 -0.0993275 -0.1737009 -0.1540309 0.216306 -0.156828 -0.0819309 0.0074101 -0.0976073 -0.0587462 -0.0483891 0.0304967 -0.0024824 -0.0668535 0.0086703 0.0886291 -0.0059388 0.0579978 0.1136699 0.0672457 -0.0291647 0.0460495 0.123675 -0.0558757 -0.1019044 -0.0771303 0.0032579 0.0345207 -0.0353993 0.1100701 -0.0144189 0.0955198 0.0344645 -0.1138833 0.1744166 0.0712688 0.0260131 -0.0878377 -0.0063843 -0.061998 0.0017409 -0.0180847 0.0786535 0.0145551 0.0548006 0.0039609 0.0361855 -0.1282014 -0.063098 -0.0015636 -0.0893746 0.0638318 -0.0492213 -0.0870161 0.0685856 -0.0296083 0.0682526 -0.0217198 0.0911495 0.0565809 -0.1304113 0.0600043 0.0374888 0.1414078 0.001841 -0.0253382 0.0204208 0.0347444 -0.0354496 -0.1593259 -0.1445255 -0.0717994 -0.0421386 -0.0467371 -0.000336 -0.0220438 -0.0114134 -0.0028555 0.0934046 0.1290758 -0.0091299 -0.0167146 -0.0064891 0.0520823 0.0973284 0.0084988 0.0724262 0.1093751 -0.0483081 -0.0184611 -0.06725 0.0173185 0.1428185 0.0474259 -0.0899851 0.0375468 0.1272657 0.0423145 -0.0711516 0.002101 -0.0615468 0.1017719 0.0821441 -0.026736 0.0687139 0.1454292 unknown
polarizability: 182.0451525|10.958032|155.4803717|6.7353708|-16.9990247|90.2037024 unknown
InChI: InChI=1S/C9H11NOS2/c12-9(8-2-1-7-13-8)10-3-5-11-6-4-10/h1-2,7H,3-6H2
charge 0 multiplicity 1
24 atoms
S  1.641306 1.207292 -0.929899
S  0.275039 -2.706788 0.265188
O  -3.425611 1.197683 -0.328717
N  -1.03064 -0.300518 0.310166
C  -1.215877 1.097261 0.787954
C  -2.328059 -0.997924 0.143475
C  -2.126961 1.872775 -0.18263
C  -3.225373 -0.18165 -0.808061
C  0.171387 -0.98223 0.280451
C  1.424899 -0.203738 0.21884
C  2.631983 -0.481967 0.854468
C  3.712618 0.394987 0.492139
C  3.361024 1.347587 -0.452563
H  -0.24401 1.598554 0.903018
H  -1.706948 1.051234 1.781832
H  -2.816912 -1.105844 1.132355
H  -2.133548 -2.008625 -0.253551
H  -2.356932 2.875056 0.214025
H  -1.630499 1.969748 -1.172239
H  -2.774009 -0.164645 -1.82328
H  -4.233352 -0.623649 -0.861512
H  2.725886 -1.317402 1.551173
H  4.719793 0.313658 0.907285
H  3.978694 2.112043 -0.921417
