program: Gaussian 09
title: 000292729
version: EM64L-G09RevD.01
frameworkgroup: C1[X(C15H30)]
method: RPBEPBE
basis: SDD
operation: Freq
keyword: #p
keyword: freq=noraman
keyword: PBEPBE/SDD
title: #p freq=noraman PBEPBE/SDD
converged: YES YES NO NO
title: Mulliken charges:
elementType: C C C C C C C C C C C C C C C H H H H H H H H H H H H H H H H H H H H H H H H H H H H H H
charge: -0.387444 -0.368070 -0.359912 -0.374020 -0.420784 -0.351720 -0.549631 -0.356789 0.436227 -0.319622 -0.438711 -0.696718 -0.835039 -0.358170 -0.684105 0.188107 0.204952 0.190442 0.185454 0.202064 0.187129 0.186899 0.189116 0.203858 0.196586 0.188275 0.186843 0.216236 0.196353 0.194571 0.194858 0.202851 0.193989 0.203927 0.209736 0.214539 0.209566 0.231070 0.222073 0.223816 0.193736 0.201009 0.232527 0.204267 0.209660
chargesum: 0.00000
title: Mulliken charges with hydrogens summed into heavy atoms:
elementType: C C C C C C C C C C C C C C C
charge: 0.005615 0.007826 0.029281 0.001995 -0.020341 0.023398 -0.137042 0.032640 0.436227 -0.116771 -0.040796 -0.062878 -0.158081 0.036576 -0.037650
polarizability: 1.79567667e+02 -9.27437224e+00 1.74212337e+02 2.61952541e+00 -4.29240139e+00 1.37222843e+02
1716.lowfreq: -16.4271 -0.0007 -0.0006 0.0006 1.8416 11.5520 18.4380 27.2664 35.2604
frequency: 15.7845 26.4261 34.9317 44.7643 48.1820 69.0235 73.1206 88.5045 101.5663 113.7313 129.0994 140.1462 161.6409 168.8766 218.6217 230.3558 244.9941 251.3688 285.3111 315.1517 332.6940 368.5016 392.9555 443.5199 455.8009 472.1943 479.2711 560.5232 716.5824 720.7947 737.1304 758.7077 767.0380 798.2610 811.3183 837.5714 876.3139 884.5134 887.3914 894.8503 917.3772 933.3959 971.1172 994.8932 1002.8284 1011.1243 1029.9096 1034.9066 1060.2666 1067.1906 1073.0811 1080.2888 1082.8352 1091.1019 1111.6567 1114.1353 1134.7890 1171.7537 1187.1055 1203.7796 1220.0901 1225.7331 1232.3168 1250.8457 1256.6076 1267.6284 1278.0044 1281.3476 1291.6095 1294.9075 1308.4189 1314.1612 1322.8312 1338.4097 1343.4550 1346.4800 1353.5003 1358.0223 1369.0045 1384.6368 1388.7077 1393.0955 1453.7086 1456.3767 1458.8914 1459.9139 1462.9986 1463.6080 1467.0665 1469.4152 1471.4941 1474.6367 1474.9019 1476.6293 1477.3353 1482.0513 1484.6114 1487.2552 1685.6147 2946.1924 2948.1807 2950.8453 2951.9494 2953.2716 2954.6614 2961.2025 2963.0861 2966.6670 2970.4396 2970.7809 2971.3343 2974.6565 2981.3276 2989.8239 2999.0192 3008.6337 3013.4957 3017.4006 3028.1614 3030.3698 3032.7565 3034.4909 3039.4341 3053.9462 3066.7533 3068.6635 3069.4378 3072.5951 3092.3750
redmass: 2.8330 1.8276 2.9566 2.7579 3.1600 3.2328 2.2937 1.7309 1.5281 1.7666 2.0635 1.8757 2.1825 1.9116 2.0165 1.1254 2.1925 2.0126 3.1685 2.1733 2.3654 2.0663 2.7858 2.4548 2.9269 2.5695 2.1486 2.1859 1.1297 1.1095 1.2855 1.5635 1.1814 1.4342 1.9532 1.6240 1.9062 1.7124 1.8034 1.4917 1.5162 1.6053 1.6137 2.7014 1.2301 2.0365 2.2477 1.7075 1.8387 1.7693 2.3611 2.4157 2.0033 1.7293 1.9821 1.9334 2.3761 1.3872 1.7087 1.6251 1.3680 1.3561 1.4182 1.3018 1.3223 1.2948 1.1704 1.0640 1.0776 1.1470 1.4233 1.3001 1.4037 1.4169 1.4147 1.4909 1.7095 1.5979 1.3966 1.2288 1.2184 1.2807 1.0737 1.0826 1.0796 1.0728 1.0740 1.0860 1.0792 1.0703 1.0568 1.0675 1.0744 1.0643 1.0426 1.0857 1.0628 1.0877 6.9072 1.0591 1.0592 1.0624 1.0600 1.0643 1.0592 1.0584 1.0419 1.0586 1.0401 1.0581 1.0441 1.0535 1.0962 1.0976 1.0989 1.1008 1.1022 1.0989 1.1040 1.0965 1.0970 1.0950 1.1041 1.0910 1.1007 1.0996 1.0993 1.0997 1.0953
irintensity: 0.0038 0.0027 0.0026 0.0605 0.0562 0.1088 0.4029 0.0205 0.2202 0.1610 0.1078 0.0005 0.0438 0.0812 0.1002 0.0070 0.0857 0.8375 0.4028 0.3939 0.2863 1.2555 0.4151 2.4956 0.1085 2.3654 1.6452 6.3504 17.3277 3.3701 3.0981 7.3157 8.2835 1.5424 7.2999 1.8515 4.5290 9.9416 3.3441 2.9102 2.1858 2.1041 1.2875 0.7946 1.2851 5.1796 2.3779 0.1571 9.3273 5.1429 1.4595 1.4086 0.6647 4.9002 2.3415 6.0126 4.2500 5.8411 0.1018 1.4580 2.2396 3.9347 0.8024 1.0146 0.7432 0.8568 0.7156 0.5264 1.5091 0.8207 1.3748 0.4438 1.5686 1.5085 0.9934 0.4082 0.4281 1.9611 0.5323 9.4206 11.5214 24.2792 4.0912 6.7312 3.7532 1.7655 1.2482 10.3439 0.8586 7.4448 12.1516 4.2161 5.1053 20.0874 12.6883 4.9462 6.7248 24.3587 2.2693 0.1732 0.0501 25.3688 2.3807 30.1001 2.7019 67.8479 18.7723 148.5853 65.2077 69.6509 51.5488 18.2487 1.3180 3.6902 7.9261 6.5875 9.9991 23.6739 0.6054 42.7782 59.8670 3.3791 225.3148 48.5361 101.0240 77.2844 50.5459 68.2446 35.3469
temp: 298.150 k
press: 1.00000 atm
elementType: 6 6 6 6 6 6 6 6 6 6 6 6 6 6 6 1 1 1 1 1 1 1 1 1 1 1 1 1 1 1 1 1 1 1 1 1 1 1 1 1 1 1 1 1 1
symmnumber: 1
zpe: 1084650.1 jmol-1
zpe.correction: 0.413121 hartree
zpe.thermalcorrener: 0.433628 hartree
zpe.thermalcorrenthalpy: 0.434573 hartree
zpe.thermalcorrgfe: 0.360674 hartree
zpe.sumelectzpe: -588.322939 hartree
zpe.sumelectthermal: -588.302432 hartree
zpe.sumelectthermalent: -588.301488 hartree
zpe.sumelectthermalfe: -588.375387 hartree
dipole: 0.1938 -0.1315 0.1405
dipole: 0.2731
quadrupole: -99.2276 -95.9251 -99.0674
quadrupole: 0.4900 2.2034 -0.4551
quadrupole: -1.1543 2.1482 -0.9940 0.4900 2.2034 -0.4551
hfenergy: -588.7360607 hartree
pointgroup: C01 [X(C15H30)]
dipole: -0.0736483 -0.0578085 -0.0527248 debye
polarizability: 178.7911477|9.5609827|175.3311073|2.3035028|2.2572177|136.8805918 unknown
InChI: InChI=1S/C15H30/c1-4-6-8-9-10-11-12-14-15(3)13-7-5-2/h13H,4-12,14H2,1-3H3
charge 0 multiplicity 1
45 atoms
C  0.578399 -1.518058 0.241446
C  1.779187 -0.888036 -0.500213
C  -0.55888 -1.947761 -0.713571
C  2.939438 -0.484214 0.437098
C  -1.748485 -2.647701 -0.013784
C  4.136936 0.147665 -0.308081
C  -2.544997 -1.741308 0.972798
C  5.303551 0.540958 0.626693
C  -3.126096 -0.477967 0.340164
C  -2.762347 0.753703 0.804135
C  -3.209127 2.123227 0.331042
C  6.495168 1.170343 -0.127245
C  -4.112011 -0.710029 -0.792633
C  -2.012665 3.056888 -0.013935
C  -1.186172 2.565912 -1.221769
H  0.925398 -2.401366 0.818543
H  0.190853 -0.790823 0.98332
H  1.432782 0.005478 -1.061774
H  2.156124 -1.604268 -1.260587
H  -0.929169 -1.055167 -1.258868
H  -0.140362 -2.632604 -1.480219
H  3.286787 -1.378865 0.995666
H  2.563433 0.230249 1.19937
H  -2.440347 -3.045426 -0.783255
H  -1.375375 -3.528189 0.548865
H  3.792046 1.046565 -0.86108
H  4.508653 -0.563879 -1.075284
H  -1.893347 -1.460194 1.821907
H  -3.371247 -2.35135 1.39712
H  5.646499 -0.358419 1.178146
H  4.931859 1.251576 1.393098
H  -2.041834 0.782032 1.639668
H  -3.87295 2.047876 -0.55075
H  -3.80508 2.607975 1.133791
H  6.184668 2.08743 -0.662976
H  7.315134 1.442941 0.56264
H  6.904461 0.467746 -0.877914
H  -3.620148 -1.197631 -1.657328
H  -4.923483 -1.390404 -0.466224
H  -4.576892 0.221565 -1.153484
H  -1.355173 3.141944 0.87529
H  -2.399631 4.075432 -0.217175
H  -0.775328 1.556921 -1.032729
H  -1.813762 2.506846 -2.13143
H  -0.34177 3.247191 -1.435095
