program: Gaussian 09
title: 000292687
version: EM64L-G09RevD.01
frameworkgroup: C1[X(C15H15NO2)]
method: RPBEPBE
basis: SDD
operation: Freq
keyword: #p
keyword: freq=noraman
keyword: PBEPBE/SDD
title: #p freq=noraman PBEPBE/SDD
converged: YES YES NO NO
title: Mulliken charges:
elementType: O O N C C C C C C C C C C C C C C C H H H H H H H H H H H H H H H
charge: -0.259967 -0.261992 -0.217554 0.415831 0.226634 0.106805 -0.689211 -0.305177 -0.342905 -0.330375 -0.374228 0.331114 -0.370982 -0.353078 -0.231818 -0.239567 -0.251037 -0.537326 0.224595 0.255305 0.269274 0.240254 0.267312 0.314927 0.243933 0.243513 0.255186 0.225132 0.221879 0.227660 0.248986 0.224660 0.222215
chargesum: 0.00000
title: Mulliken charges with hydrogens summed into heavy atoms:
elementType: O O N C C C C C C C C C C C C C C C
charge: -0.259967 -0.261992 -0.217554 0.415831 0.226634 0.106805 0.059963 -0.064923 -0.075593 -0.015448 -0.130295 0.331114 -0.127468 -0.097891 -0.006686 -0.017688 -0.023376 0.158534
polarizability: 3.04445873e+02 1.24398794e+00 1.63052927e+02 8.44564673e+00 1.06850898e+00 9.67493614e+01
1716.lowfreq: -4.9062 0.0008 0.0010 0.0011 4.1366 9.3030 26.5316 37.0248 51.1936
frequency: 26.3368 36.8684 51.1787 63.4439 117.0127 140.0620 167.1302 186.6396 210.1526 237.5062 262.4627 283.5273 298.9011 334.6431 348.4936 395.8147 412.6228 419.0658 427.7201 467.5460 513.9973 525.8716 578.7468 588.9096 616.8432 626.6609 674.0431 694.0362 696.7470 752.8226 764.1208 767.6224 812.5350 817.7887 839.8227 848.8125 915.7095 952.9116 973.0956 974.5771 982.4765 984.1993 997.0259 1001.7850 1023.6802 1037.1663 1091.6135 1096.9307 1111.5982 1115.0362 1117.9256 1156.3017 1172.5407 1177.6627 1190.2718 1203.3375 1234.1358 1241.8193 1300.6381 1312.5067 1340.6342 1370.7399 1379.2398 1421.9091 1435.5079 1441.5515 1447.3854 1467.3671 1471.9936 1484.3275 1484.9555 1496.0943 1502.7230 1549.9254 1579.4213 1585.0386 1611.9276 1617.6893 2963.1006 2978.0495 3052.7096 3055.3655 3125.9330 3129.0053 3136.3638 3136.8317 3139.7352 3153.4370 3159.1284 3166.6022 3175.1023 3176.2771 3207.4866
redmass: 4.8869 3.9158 4.4992 4.2680 4.1525 4.4533 3.3851 4.1069 2.0989 2.0173 3.0926 3.8381 1.5154 4.4880 3.2983 2.9812 2.8341 3.3480 4.4011 4.3758 3.1630 3.1034 5.8274 4.5234 6.3616 6.6144 5.2920 4.3528 2.1160 4.7794 3.8027 1.9697 4.6024 1.3620 1.2544 1.6568 1.4171 1.3535 1.3557 1.3999 5.6555 6.6941 3.7036 1.3098 2.8118 2.0439 1.7811 2.1629 1.2602 1.3489 1.3056 1.3247 1.2102 1.2843 1.8660 1.2068 2.9447 4.4319 1.3419 2.1094 1.8059 5.3631 7.9956 4.0157 1.1818 1.9360 1.3213 1.0504 1.0747 1.3321 1.5101 1.7533 1.3179 8.5657 7.1885 6.6107 6.0498 6.2355 1.0329 1.0390 1.1041 1.1009 1.0850 1.0994 1.0907 1.0895 1.0949 1.0883 1.0967 1.0945 1.0972 1.0949 1.0939
irintensity: 1.0117 0.2579 0.0465 2.1776 5.4419 4.9326 1.8549 0.8952 2.1880 1.0889 2.8405 7.7968 0.3901 2.5316 2.6214 0.1278 0.3702 1.1083 0.5406 0.4779 12.8179 19.9321 32.3821 14.9673 1.9878 2.6225 2.3170 7.1460 46.8961 5.2448 2.6274 93.7733 4.6110 12.0547 0.4991 57.7883 10.4072 1.4870 0.3645 8.9127 24.8085 49.5071 33.0073 2.7540 19.9417 92.3897 12.0690 70.2469 0.2635 12.1584 9.5422 3.2422 25.4487 174.6780 6.3782 5.5862 150.6113 90.8654 55.4237 270.2813 231.7055 2.9069 1.2018 15.2629 10.5204 20.2905 24.5665 14.8647 48.1947 62.6340 114.0421 72.3921 6.8387 122.6832 37.1363 31.7854 120.1216 100.0006 66.9096 42.6010 45.8029 28.3060 1.8202 27.8882 26.0959 8.7752 4.7652 1.7397 41.0452 12.6120 5.9025 11.3801 14.3540
temp: 298.150 k
press: 1.00000 atm
elementType: 8 8 7 6 6 6 6 6 6 6 6 6 6 6 6 6 6 6 1 1 1 1 1 1 1 1 1 1 1 1 1 1 1
symmnumber: 1
zpe: 692727.6 jmol-1
zpe.correction: 0.263846 hartree
zpe.thermalcorrener: 0.279900 hartree
zpe.thermalcorrenthalpy: 0.280844 hartree
zpe.thermalcorrgfe: 0.219214 hartree
zpe.sumelectzpe: -784.494643 hartree
zpe.sumelectthermal: -784.478590 hartree
zpe.sumelectthermalent: -784.477645 hartree
zpe.sumelectthermalfe: -784.539276 hartree
dipole: 2.3784 -4.9149 0.2622
dipole: 5.4664
quadrupole: -89.1314 -101.1872 -106.5542
quadrupole: -5.3472 -3.7763 1.3151
quadrupole: 9.8262 -2.2296 -7.5966 -5.3472 -3.7763 1.3151
hfenergy: -784.7584894 hartree
pointgroup: C01 [X(C15H15N1O2)]
dipole: 0.9432723 1.856841 0.5363508 debye
polarizability: 304.4654217|0.9513548|155.2688429|-8.1905765|21.3925176|104.5138975 unknown
InChI: InChI=1S/C15H15NO2/c1-16(13-6-4-3-5-7-13)15(17)12-8-10-14(18-2)11-9-12/h3-11H,1-2H3
charge 0 multiplicity 1
33 atoms
O  5.390826 -0.060095 0.000462
O  -0.6492 -1.921791 -0.699254
N  -1.189472 0.369365 -0.46565
C  -2.589608 0.2139 -0.152194
C  1.190495 -0.41383 -0.422143
C  -0.279436 -0.71428 -0.551191
C  -0.74011 1.730687 -0.84666
C  1.713885 0.487029 0.538349
C  2.099972 -1.192412 -1.190133
C  -3.221419 -1.058802 -0.021392
C  -3.37902 1.382103 0.064358
C  3.995531 -0.126442 -0.079099
C  3.105662 0.634187 0.72134
C  3.485839 -1.043066 -1.036258
C  -4.586667 -1.140567 0.322226
C  -4.745203 1.281491 0.401408
C  -5.364176 0.020008 0.534362
C  5.976838 0.852934 0.986839
H  -0.718623 2.425168 0.014113
H  -1.422831 2.140246 -1.612916
H  0.268502 1.678437 -1.275626
H  1.032239 1.059942 1.17706
H  1.696072 -1.925219 -1.895812
H  -2.643199 -1.963615 -0.204109
H  -2.938849 2.379488 -0.00901
H  3.478169 1.323447 1.484454
H  4.194097 -1.628103 -1.630202
H  -5.04567 -2.131605 0.41424
H  -5.322337 2.198945 0.56397
H  -6.425412 -0.056401 0.793879
H  7.064325 0.741008 0.869107
H  5.681932 0.574114 2.016854
H  5.685244 1.902031 0.786036
