program: Gaussian 09
title: 000292657
version: EM64L-G09RevD.01
frameworkgroup: C1[X(C4H6N4OS)]
method: RPBEPBE
basis: SDD
operation: Freq
keyword: #p
keyword: freq=noraman
keyword: PBEPBE/SDD
title: #p freq=noraman PBEPBE/SDD
converged: YES YES NO NO
title: Mulliken charges:
elementType: S O N N N N C C C C H H H H H H
charge: 0.250879 -0.204986 -0.199672 -0.073801 -0.610506 -0.622733 -0.768736 -0.190246 0.120777 0.272465 0.295029 0.294973 0.357856 0.321787 0.308578 0.448336
chargesum: 0.00000
title: Mulliken charges with hydrogens summed into heavy atoms:
elementType: S O N N N N C C C C
charge: 0.250879 -0.204986 -0.199672 -0.073801 0.069137 0.134181 -0.178734 -0.190246 0.120777 0.272465
polarizability: 1.58314203e+02 -1.93479798e+00 1.03557835e+02 -3.33497547e-03 -1.18065127e-02 4.13515599e+01
1716.lowfreq: -11.4224 0.0009 0.0014 0.0020 4.8832 7.0510 85.8029 106.8259 129.9748
frequency: 85.8025 106.8007 129.9711 158.9393 234.6156 315.5511 349.9758 357.5947 450.1373 500.1210 509.9956 526.7704 554.8600 582.4148 629.5872 635.1046 711.8504 731.2945 747.8385 879.9035 889.4963 934.7332 986.6152 1037.1340 1105.4574 1110.6741 1157.5767 1214.8093 1256.5653 1415.6444 1461.9252 1477.2428 1547.0136 1593.8285 1626.0990 1665.2387 2932.3937 3050.6621 3126.6605 3552.1521 3596.6104 3705.9747
redmass: 4.7735 3.4818 5.2519 6.0622 7.9901 6.8613 4.6712 1.0831 6.2921 3.3786 8.3748 1.2016 2.6925 1.1582 8.7890 10.1010 8.4330 5.7814 7.7008 6.7725 1.7765 6.7004 1.0839 1.4972 1.1443 1.7634 5.4738 1.5329 4.5652 1.0819 1.8295 7.2021 2.5003 3.0689 1.8325 2.7057 1.0772 1.0566 1.1074 1.0456 1.0835 1.1053
irintensity: 0.8633 21.9267 0.4021 11.0664 9.3604 17.6955 1.0432 12.6635 3.5284 2.7048 10.3117 417.8134 5.2001 5.3736 12.1532 3.2246 9.1270 3.1241 23.2769 17.3796 5.8492 25.1227 151.0959 1.1451 0.1141 8.5276 428.9162 31.3043 117.8398 15.2823 171.6136 785.6889 396.2524 332.2627 448.9387 555.7161 399.1011 5.3636 1.3640 120.0961 46.2895 48.7067
temp: 298.150 k
press: 1.00000 atm
elementType: 16 8 7 7 7 7 6 6 6 6 1 1 1 1 1 1
symmnumber: 1
zpe: 296934.9 jmol-1
zpe.correction: 0.113097 hartree
zpe.thermalcorrener: 0.122560 hartree
zpe.thermalcorrenthalpy: 0.123504 hartree
zpe.thermalcorrgfe: 0.078055 hartree
zpe.sumelectzpe: -847.596852 hartree
zpe.sumelectthermal: -847.587389 hartree
zpe.sumelectthermalent: -847.586444 hartree
zpe.sumelectthermalfe: -847.631893 hartree
dipole: 6.5681 -0.5779 0.0147
dipole: 6.5935
quadrupole: -40.0928 -72.6264 -67.3222
quadrupole: 13.1109 0.0447 -0.0262
quadrupole: 19.9210 -12.6126 -7.3084 13.1109 0.0447 -0.0262
hfenergy: -847.7099482 hartree
pointgroup: C01 [X(C4H6N4O1S1)]
dipole: 2.5874066 0.1744258 -0.0645091 debye
dipolederiv: -0.3795241 -0.2602744 -0.1946442 -0.2550691 -0.3186953 -0.2174586 -0.1905762 -0.2167914 -0.2104508 -0.9672875 0.2240249 0.2460171 0.4212358 -0.6572282 -0.2967378 0.4171361 -0.2798256 -0.6322221 -1.9228471 0.2462616 0.3591143 0.2069002 -0.6705922 -0.3981612 0.3269706 -0.4031292 -0.60218 -2.5403727 -0.4161845 -0.1681518 -0.6194854 -0.5752558 -0.1741462 -0.3448945 -0.1907691 -0.4479998 -1.6782178 0.1116575 0.1788862 0.0974841 -0.4511278 0.2032544 0.162976 0.2015501 -0.5374048 -0.6444197 0.0217168 0.0231905 -0.1841451 -0.8581776 -0.211286 -0.1557287 -0.2300775 -0.7761098 0.0539951 -0.2268817 -0.1898496 -0.2562145 -0.1703522 -0.2230552 -0.213916 -0.2245908 -0.0583547 2.4268439 0.4433505 0.1781935 -0.1349352 0.7703323 0.6263773 -0.3186393 0.5769502 0.5788964 1.8448551 -0.2914577 -0.3963238 -0.1676046 0.7064108 0.4618485 -0.291912 0.4728039 0.6182912 2.4974799 0.064296 -0.1265774 0.7858463 0.9749469 0.5056172 0.4987204 0.5681202 0.7537488 0.0225368 -0.0315275 0.0589103 -0.0068546 0.0477331 0.0304829 0.1046143 0.0544094 0.0571243 0.0021154 0.0505073 -0.041336 0.1011215 0.0835017 0.0368105 -0.0220342 0.0193712 0.0419964 0.2770483 -0.0363211 -0.0219313 -0.083464 0.2869686 -0.0865744 -0.0629899 -0.0905016 0.3235943 0.2567066 -0.0162778 -0.0031371 0.0117608 0.2471857 -0.1273121 0.0215525 -0.125009 0.2852562 0.1028237 -0.0596025 -0.026997 -0.047468 0.273048 -0.0975692 -0.0167784 -0.0962819 0.3094065 0.6482642 0.1767125 0.1246362 0.1308917 0.3113021 -0.0320903 0.0854995 -0.0362287 0.296408 unknown
polarizability: 157.4732949|8.5365368|77.8052986|-2.6304439|30.6385437|67.9450051 unknown
InChI: InChI=1S/C4H6N4OS/c5-3(6)8-4-7-2(9)1-10-4/h1,5-6H2
charge 0 multiplicity 1
16 atoms
S  -1.022109 -1.760747 -1.065451
O  -2.695797 0.913122 1.384586
N  -0.530037 0.29659 0.660815
N  1.413727 -0.712809 -0.37398
N  3.615104 -0.092948 -0.020388
N  1.907221 1.091182 1.136604
C  -2.487033 -0.933977 -0.222037
C  0.086538 -0.590099 -0.156129
C  -1.9300 0.192181 0.695925
C  2.289293 0.116932 0.266556
H  -3.0363 -1.669832 0.385354
H  -3.160837 -0.499128 -0.976326
H  3.826598 -0.840344 -0.678262
H  4.365741 0.455553 0.389963
H  2.566637 1.706319 1.610455
H  0.858953 1.144506 1.270114
