program: Gaussian 09
title: 000292654
version: EM64L-G09RevD.01
frameworkgroup: C1[X(C9H9ClO)]
method: RPBEPBE
basis: SDD
operation: Freq
keyword: #p
keyword: freq=noraman
keyword: PBEPBE/SDD
title: #p freq=noraman PBEPBE/SDD
converged: YES YES NO NO
title: Mulliken charges:
elementType: Cl O C C C C C C C C C H H H H H H H H H
charge: -0.035367 -0.267504 0.485011 -0.311616 -0.333938 -0.315390 -0.207925 -0.232480 -0.242157 -0.108819 -0.549300 0.249697 0.228249 0.227892 0.254968 0.228962 0.233970 0.255767 0.226380 0.213599
chargesum: 0.00000
title: Mulliken charges with hydrogens summed into heavy atoms:
elementType: Cl O C C C C C C C C C
charge: -0.035367 -0.267504 0.485011 -0.311616 -0.084240 0.140751 0.047043 -0.003518 -0.008187 0.146948 -0.109322
polarizability: 1.53251127e+02 4.06864073e+00 1.22413654e+02 5.22557288e-02 -3.81509983e-02 4.66538728e+01
1716.lowfreq: -98.0831 -7.5409 -0.0034 -0.0024 0.0010 4.4465 6.9936 55.3584 90.2990
frequency: -98.0796 55.3505 90.2922 115.6284 152.2327 205.4184 261.1504 281.3552 375.8924 394.9870 440.5186 515.6109 539.2544 562.0079 586.9058 671.3995 709.6544 749.8846 798.4770 835.9391 908.4644 923.3961 936.8994 968.2526 986.2753 993.8743 1016.9043 1023.7439 1042.2743 1130.4732 1138.9227 1172.3843 1194.4290 1233.4364 1265.3387 1277.5364 1338.2738 1380.8871 1427.4902 1429.4802 1458.4242 1477.2720 1575.0468 1604.6069 1663.2196 2944.6328 3000.3526 3093.3018 3134.4760 3138.8657 3154.3972 3166.4905 3177.7732 3204.8237
redmass: 1.9320 4.7489 5.2103 2.1283 4.3767 6.0627 5.4542 4.4156 4.0087 9.2008 3.2327 4.1219 3.4056 1.4463 7.5847 6.9811 3.4216 1.2936 5.9515 1.4161 1.9212 1.3623 1.3197 1.3103 1.0909 5.0500 1.6100 7.5492 2.0195 1.6383 1.9761 1.0659 1.0583 2.8639 1.4685 1.3301 1.3335 6.5662 1.7815 1.4401 1.4551 1.6129 6.2879 7.1797 4.9563 1.0550 1.1059 1.0619 1.0941 1.0856 1.0899 1.0939 1.1004 1.1136
irintensity: 3.6432 1.2974 0.2013 5.0953 0.1033 0.3864 0.0481 1.5941 0.3967 3.1527 5.8742 1.1927 0.4319 21.7835 2.8994 25.0480 0.9398 104.8893 12.4979 0.2389 5.9935 0.4361 77.6874 0.1685 24.7266 49.1087 7.9088 65.9376 27.1508 5.0749 13.9337 5.5104 0.6889 188.0267 27.9949 19.9904 10.4929 13.5360 40.9957 3.4867 110.9658 29.1762 12.3540 38.4882 9.3067 24.7855 33.9913 8.8664 1.8626 2.5785 11.0554 16.9902 10.5488 20.2019
temp: 298.150 k
press: 1.00000 atm
elementType: 17 8 6 6 6 6 6 6 6 6 6 1 1 1 1 1 1 1 1 1
symmnumber: 1
zpe: 400296.7 jmol-1
zpe.correction: 0.152465 hartree
zpe.thermalcorrener: 0.162377 hartree
zpe.thermalcorrenthalpy: 0.163321 hartree
zpe.thermalcorrgfe: 0.116043 hartree
zpe.sumelectzpe: -882.793423 hartree
zpe.sumelectthermal: -882.783511 hartree
zpe.sumelectthermalent: -882.782567 hartree
zpe.sumelectthermalfe: -882.829845 hartree
dipole: 0.6664 -3.1259 -0.0020
dipole: 3.1962
quadrupole: -59.8554 -67.6083 -76.4952
quadrupole: -0.3741 0.0091 -0.0245
quadrupole: 8.1309 0.3780 -8.5089 -0.3741 0.0091 -0.0245
hfenergy: -882.9458879 hartree
pointgroup: C01 [X(C9H9Cl1O1)]
dipole: 0.0467818 1.1975629 -0.3806398 debye
dipolederiv: -0.1454268 0.1724783 -0.0513721 0.1750512 -0.6296446 0.1773112 -0.0521975 0.1774688 -0.1055193 -1.8167512 -0.1687854 0.1070908 0.013182 -0.2513999 -0.0059016 0.0484028 -0.0001049 -0.2703654 1.4961598 0.1136008 -0.0832177 -0.2981357 -0.1782318 0.1099268 0.0472 0.095973 0.1041999 -0.143814 -0.2475549 0.0794641 -0.3665948 0.8972747 -0.3063319 0.1176114 -0.3106018 -0.0152932 -0.2521243 -0.1194479 0.039564 0.2988619 -0.0343111 -0.0646162 -0.0929766 -0.0497551 -0.1862788 0.8052452 0.1846084 -0.0718172 0.5634043 0.3461963 0.0115437 -0.1915011 0.0245739 0.4404085 0.0346328 0.0359072 -0.0158601 0.0494292 -0.1018693 0.0010503 -0.0203194 0.0014745 -0.0920051 0.0880091 0.0926835 -0.0376425 -0.0573182 0.0937699 -0.0753588 0.0098913 -0.080736 -0.1244304 -0.0239668 -0.036557 0.0056908 -0.0073395 -0.133655 -0.0182625 -0.0036322 -0.0172406 -0.1863761 0.2515102 -0.0136713 -0.0104116 -0.1526886 0.0485822 -0.0763157 0.0345776 -0.0809628 -0.1787753 -0.2272893 -0.0741502 0.0179367 -0.0659051 0.0527172 -0.151903 0.0146115 -0.1516 -0.3757243 0.012828 -0.0859054 0.0327887 -0.1042792 0.004871 0.0564326 0.0386162 0.0556013 0.1524858 -0.0771303 0.0125644 -0.0470719 -0.0982109 0.0185505 0.0713097 0.0041413 0.069623 -0.1124353 -0.0729918 0.032919 0.0340639 -0.0872026 -0.0911742 -0.0809487 0.055965 -0.0869981 -0.0068463 0.0389059 -0.0640281 0.0247064 -0.0760156 0.0199034 0.0482039 0.028558 0.0477872 0.1469658 0.0545608 0.0545884 -0.0136171 0.075753 -0.0708846 0.0715006 -0.0203354 0.0722394 0.140248 -0.1107438 0.0405935 -0.0029593 0.036154 0.0748834 0.0299583 -0.0014699 0.029866 0.1637326 0.0821743 -0.0222121 0.0103432 0.0381531 -0.0255207 0.0666361 -0.0087952 0.0686141 0.1627449 -0.091953 0.0642288 -0.0115355 0.074826 0.0505768 0.0444994 -0.0149268 0.0448094 0.1817603 0.0981653 0.0281401 -0.0061436 -0.0111246 -0.0906341 0.0912658 0.006579 0.0899687 0.1615038 unknown
polarizability: 153.6033651|0.2713107|115.0207668|-3.7545134|-21.7427949|53.6945216 unknown
InChI: InChI=1S/C9H9ClO/c1-2-7-11-9-6-4-3-5-8(9)10/h2-6H,1,7H2
charge 0 multiplicity 1
20 atoms
Cl -0.720054 -2.739878 0.817569
O  0.960505 -0.433705 0.027621
C  -0.390271 -0.091644 -0.033938
C  -1.325743 -1.101083 0.319091
C  -0.884434 1.181089 -0.42067
C  1.948058 0.599853 -0.334387
C  -2.708674 -0.859598 0.290911
C  -2.275692 1.426938 -0.450511
C  -3.191474 0.413547 -0.096713
C  3.309553 -0.040168 -0.171784
C  4.486759 0.585261 -0.411058
H  -0.19041 1.979838 -0.697702
H  1.775022 0.928848 -1.38053
H  1.828649 1.478113 0.334178
H  -3.39922 -1.661047 0.570025
H  -2.63819 2.415432 -0.75193
H  -4.269301 0.601246 -0.118568
H  3.282935 -1.083868 0.166014
H  5.439408 0.064402 -0.273195
H  4.540474 1.627824 -0.749523
