program: Gaussian 09
title: 000292663
version: EM64L-G09RevD.01
frameworkgroup: C1[X(C15H15ClN2)]
method: RPBEPBE
basis: SDD
operation: Freq
keyword: #p
keyword: freq=noraman
keyword: PBEPBE/SDD
title: #p freq=noraman PBEPBE/SDD
converged: YES YES NO NO
title: Mulliken charges:
elementType: Cl N N C C C C C C C C C C C C C C C H H H H H H H H H H H H H H H
charge: -0.083249 -0.149064 -0.095458 0.410453 0.464879 -0.360230 -0.336444 -0.396040 -0.403090 -0.645887 -0.646133 -0.393997 0.285946 -0.323171 -0.392420 -0.071721 -0.183396 -0.268304 0.238678 0.238683 0.223935 0.270793 0.238210 0.219534 0.238337 0.218916 0.239447 0.238993 0.216065 0.266991 0.254176 0.229930 0.254639
chargesum: 0.00000
title: Mulliken charges with hydrogens summed into heavy atoms:
elementType: Cl N N C C C C C C C C C C C C C C C
charge: -0.083249 -0.149064 -0.095458 0.410453 0.464879 -0.121552 -0.097761 -0.172105 -0.132297 0.050194 0.051223 -0.177932 0.285946 -0.056180 -0.138244 -0.071721 0.046533 -0.013665
polarizability: 4.52253581e+02 -1.61709391e+01 1.80156030e+02 7.37589853e+00 4.13371376e+00 9.41007248e+01
1716.lowfreq: -5.6035 -0.1376 -0.0025 -0.0019 -0.0014 3.8914 26.7108 34.0537 44.5590
frequency: 26.6660 34.0533 44.5574 75.3772 85.9252 119.6488 122.9349 162.5086 179.8653 198.3488 211.7879 251.4078 253.5677 260.2910 326.9484 378.0821 379.8863 396.8686 428.4596 443.0027 461.8313 494.3665 513.2228 530.3988 574.7969 605.2681 632.1659 671.2893 685.0243 725.9140 741.7030 782.4305 808.4937 829.8039 837.9057 859.7283 875.3652 895.1914 940.0961 943.1673 972.2000 975.0481 980.2449 989.0031 994.6382 1055.7998 1062.7767 1085.6794 1105.9319 1111.1980 1127.9232 1161.4677 1165.4694 1178.7585 1198.1034 1257.2610 1261.0405 1281.2720 1317.6437 1356.5999 1361.4075 1368.6330 1391.5528 1417.8264 1429.8227 1450.1411 1457.1488 1461.9766 1464.8982 1476.9330 1492.7541 1506.0269 1532.8607 1549.2447 1553.1626 1580.5778 1613.5393 1634.6334 2934.2478 2946.6232 2953.8744 3014.7351 3018.0951 3100.0944 3110.1662 3115.7614 3140.4754 3146.2986 3158.3315 3166.7405 3166.9841 3170.4054 3178.5330
redmass: 4.7685 4.3219 5.3777 2.3316 4.9560 2.0740 3.2913 2.2763 5.2752 1.1689 4.1834 3.2005 4.8967 3.2333 4.2315 11.2176 3.7305 3.7545 3.0120 3.1836 4.1124 4.1515 3.9586 2.5526 4.8650 5.8031 7.1436 7.0131 2.2097 4.8876 3.3412 1.4114 1.3135 1.6493 3.7060 2.4138 2.6951 1.5112 3.0469 1.3677 1.3371 2.7933 1.8823 1.4977 2.9033 1.5050 1.9980 1.5503 1.2383 1.3250 1.4902 1.3919 1.5461 1.7702 1.3288 2.8991 1.6759 1.3086 1.5409 2.7536 3.1728 3.7112 2.7056 3.4690 1.2494 2.7022 1.5039 1.8997 1.0402 1.0458 1.1077 1.1313 2.8080 7.0089 6.2072 6.3447 6.6308 6.4031 1.0857 1.0367 1.0391 1.0997 1.1026 1.0966 1.0945 1.0895 1.0873 1.0875 1.0920 1.0938 1.0931 1.0947 1.0985
irintensity: 0.1575 1.1323 0.9637 0.2133 0.4777 3.8061 2.5037 3.9310 0.3726 0.0236 0.0731 1.7376 5.4047 1.6521 2.8864 7.5500 9.7484 0.4870 1.0937 4.2430 3.6150 7.9140 17.9996 19.3414 1.7292 1.0038 0.2635 27.6036 26.1207 4.2851 5.0636 48.6285 13.5571 57.1653 9.1194 94.1552 61.4864 8.2561 31.1584 2.4242 1.5470 21.4078 1.5828 9.5203 0.0509 25.4234 19.2338 24.0524 0.0246 0.9798 9.6122 43.8152 0.8196 120.5258 64.9252 26.4216 15.9462 1.9852 20.8020 8.9680 25.7566 301.1640 3.8576 7.9486 16.0315 37.1339 7.2632 101.6650 0.0384 23.0942 6.7616 61.0967 423.0166 185.6162 85.9529 691.9024 60.0655 266.0471 51.4681 97.4760 155.4238 9.5518 70.8312 4.1627 48.4450 9.9855 15.2749 2.9267 2.1394 20.1415 6.2140 18.7604 9.6004
temp: 298.150 k
press: 1.00000 atm
elementType: 17 7 7 6 6 6 6 6 6 6 6 6 6 6 6 6 6 6 1 1 1 1 1 1 1 1 1 1 1 1 1 1 1
symmnumber: 1
zpe: 684807.7 jmol-1
zpe.correction: 0.260829 hartree
zpe.thermalcorrener: 0.277835 hartree
zpe.thermalcorrenthalpy: 0.278780 hartree
zpe.thermalcorrgfe: 0.214232 hartree
zpe.sumelectzpe: -1148.860628 hartree
zpe.sumelectthermal: -1148.843623 hartree
zpe.sumelectthermalent: -1148.842678 hartree
zpe.sumelectthermalfe: -1148.907226 hartree
dipole: 7.1713 0.2085 -0.5688
dipole: 7.1968
quadrupole: -80.3734 -106.4104 -117.4519
quadrupole: -9.8296 5.2461 2.9744
quadrupole: 21.0385 -4.9985 -16.0400 -9.8296 5.2461 2.9744
hfenergy: -1149.121458 hartree
pointgroup: C01 [X(C15H15Cl1N2)]
dipole: 2.8136064 -0.2666123 -0.1721371 debye
polarizability: 452.89298|11.2977807|103.7546279|-6.0211949|26.9463823|169.862728 unknown
InChI: InChI=1S/C15H15ClN2/c1-18(2)15-8-6-12(7-9-15)11-17-14-5-3-4-13(16)10-14/h3-11H,1-2H3
charge 0 multiplicity 1
33 atoms
Cl -5.545657 1.313708 2.109723
N  5.250658 0.17364 -0.080608
N  -1.267217 -0.3315 -0.527224
C  3.867882 0.060391 0.055496
C  1.01087 -0.170056 0.32881
C  3.254411 -0.045135 1.347803
C  3.007017 0.046571 -1.096407
C  1.861864 -0.15737 1.469728
C  1.619909 -0.065795 -0.956321
C  6.110477 0.1824 1.111347
C  5.856715 0.28747 -1.415233
C  -0.43561 -0.281897 0.492434
C  -2.669417 -0.344405 -0.336397
C  -3.32086 0.390764 0.701196
C  -3.462527 -1.076734 -1.264878
C  -4.721459 0.348971 0.786425
C  -4.864939 -1.107433 -1.138695
C  -5.520182 -0.390062 -0.107192
H  3.8673 -0.038731 2.25299
H  3.432434 0.124803 -2.100733
H  1.4179 -0.236888 2.47071
H  0.967765 -0.07594 -1.836048
H  5.876054 1.034899 1.780192
H  7.163521 0.273299 0.80314
H  6.006115 -0.752332 1.698133
H  6.949999 0.37012 -1.314479
H  5.495152 1.18574 -1.954507
H  5.638497 -0.600037 -2.042499
H  -0.796379 -0.34817 1.542676
H  -2.741563 1.006548 1.396086
H  -2.951362 -1.614511 -2.068873
H  -5.464434 -1.683948 -1.851444
H  -6.609431 -0.393783 -0.013352
