program: Gaussian 09
title: 000292656
version: EM64L-G09RevD.01
frameworkgroup: C1[X(C11H12N2O3)]
method: RPBEPBE
basis: SDD
operation: Freq
keyword: #p
keyword: freq=noraman
keyword: PBEPBE/SDD
title: #p freq=noraman PBEPBE/SDD
converged: YES YES NO NO
title: Mulliken charges:
elementType: O O O N N C C C C C C C C C C C H H H H H H H H H H H H
charge: -0.272973 -0.210731 -0.179501 -0.072641 -0.010188 0.219360 0.240880 0.092670 -0.352204 -0.349298 -0.309535 -0.100834 -0.228673 -0.215107 -0.650791 -0.615372 0.281405 0.272403 0.241941 0.278457 0.239051 0.241244 0.247105 0.234115 0.263173 0.236525 0.239511 0.240007
chargesum: 0.00000
title: Mulliken charges with hydrogens summed into heavy atoms:
elementType: O O O N N C C C C C C C C C C C
charge: -0.272973 -0.210731 -0.179501 -0.072641 -0.010188 0.219360 0.240880 0.092670 -0.070799 -0.076895 -0.067593 0.177623 0.010379 0.026137 0.093602 0.100672
polarizability: 2.40760829e+02 1.37673183e+01 1.53198446e+02 1.38221414e+01 -7.68344107e+00 8.89657763e+01
1716.lowfreq: -6.4966 0.0002 0.0008 0.0009 1.5338 7.3666 28.6535 32.6746 45.6866
frequency: 28.6484 32.6554 45.6509 72.4225 88.6764 112.8061 119.6894 143.4734 172.0027 176.4412 231.6152 239.4093 276.6893 291.4386 353.5250 385.2512 390.6123 408.3263 426.5052 499.7287 547.0175 576.0692 632.2623 658.3043 667.0195 697.6222 761.2066 776.7725 783.9404 807.2625 831.5273 887.0236 893.2238 969.6889 972.9492 999.0008 1029.5318 1046.7817 1058.7772 1075.7669 1093.5535 1114.1504 1131.4210 1131.7763 1173.8649 1197.5022 1221.6843 1236.8933 1266.7494 1296.8046 1344.6063 1364.8030 1382.6909 1415.4576 1424.1255 1435.3762 1449.8032 1460.0551 1463.8681 1473.7418 1490.0811 1499.9767 1518.2624 1572.5317 1601.7577 1643.3008 2965.7117 2971.7848 3042.1242 3046.8582 3105.0492 3110.9284 3131.5768 3141.5026 3157.1740 3160.7628 3168.8645 3180.3093
redmass: 6.2100 2.8099 6.8074 4.3002 1.7450 2.9392 3.1704 1.6251 5.1288 2.2876 3.2632 4.6623 3.8178 5.6338 8.1778 4.4575 3.1641 3.5234 2.8004 4.1537 5.0682 4.1487 6.6945 5.6971 7.1725 4.5590 4.0263 6.7750 1.4366 5.9699 1.6436 3.2743 1.5959 1.3877 1.2393 1.3534 2.9579 4.8192 1.5398 2.1992 1.2284 1.7393 1.4805 1.7221 1.0660 1.8189 9.0674 2.8200 1.5551 1.5931 1.9357 11.5375 6.9447 2.1455 2.3922 1.1456 1.4664 2.0806 1.0472 1.0417 1.0614 1.2810 8.4198 6.5468 6.7053 5.0829 1.0351 1.0366 1.1020 1.1014 1.0985 1.0988 1.0922 1.0865 1.0906 1.0905 1.0953 1.0993
irintensity: 7.2323 1.5340 3.3420 0.9553 0.6332 0.0307 0.6865 0.8607 4.2517 0.4882 2.6491 0.9762 0.8012 4.7116 2.7216 5.2802 7.3930 1.9502 0.5635 2.5084 3.1512 3.7432 7.7682 3.5437 26.3406 24.9434 14.7745 8.5268 65.3533 2.6765 32.7264 35.4644 10.3961 1.9323 22.4611 3.3645 31.2225 16.5223 13.0646 50.9019 0.5191 47.8399 1.7752 2.8588 2.7741 8.2932 154.8661 108.0621 43.9476 18.3238 89.9419 154.1241 10.2955 9.8787 1.9686 28.0550 104.1817 1.5741 29.0970 1.1187 10.8802 24.8643 369.9902 4.0814 14.5016 695.6528 57.2118 89.0275 32.6737 23.0295 5.8597 26.8419 2.6084 3.9904 6.8054 8.0661 7.0554 14.0078
temp: 298.150 k
press: 1.00000 atm
elementType: 8 8 8 7 7 6 6 6 6 6 6 6 6 6 6 6 1 1 1 1 1 1 1 1 1 1 1 1
symmnumber: 1
zpe: 560778.2 jmol-1
zpe.correction: 0.213589 hartree
zpe.thermalcorrener: 0.229448 hartree
zpe.thermalcorrenthalpy: 0.230392 hartree
zpe.thermalcorrgfe: 0.168387 hartree
zpe.sumelectzpe: -760.268822 hartree
zpe.sumelectthermal: -760.252964 hartree
zpe.sumelectthermalent: -760.252019 hartree
zpe.sumelectthermalfe: -760.314025 hartree
dipole: 2.6651 -0.2566 -3.6529
dipole: 4.5291
quadrupole: -50.5359 -103.6873 -98.9175
quadrupole: 4.5511 -0.0549 1.3646
quadrupole: 33.8443 -19.3071 -14.5372 4.5511 -0.0549 1.3646
hfenergy: -760.4824113 hartree
pointgroup: C01 [X(C11H12N2O3)]
dipole: 1.1460787 -0.8786292 -1.0438204 debye
polarizability: 235.7772448|30.9487178|124.9891273|5.9347949|-32.4628869|122.1586792 unknown
InChI: InChI=1S/C11H12N2O3/c1-12(2)8-7-11(14)9-5-3-4-6-10(9)13(15)16/h3-8H,1-2H3
charge 0 multiplicity 1
28 atoms
O  0.601961 -1.200848 2.061855
O  -1.204719 1.960319 -1.994007
O  -0.266547 2.049612 0.085439
N  3.848697 0.004311 -0.3528
N  -0.996908 1.477859 -0.809626
C  -1.056461 -0.760769 0.382328
C  -1.674358 0.204448 -0.457565
C  0.385796 -0.760888 0.876993
C  -1.849736 -1.874041 0.76225
C  -2.992197 0.055479 -0.945581
C  1.433757 -0.364166 -0.050495
C  2.753829 -0.359984 0.379239
C  -3.174605 -2.031708 0.304843
C  -3.745715 -1.071312 -0.563965
C  3.694927 0.468018 -1.742216
C  5.204481 -0.028262 0.219507
H  -1.390286 -2.610174 1.429177
H  -3.409137 0.830498 -1.594918
H  1.164887 -0.06941 -1.068448
H  2.941487 -0.672547 1.413959
H  -3.758032 -2.903687 0.618775
H  -4.771602 -1.189517 -0.927039
H  3.2735 -0.330796 -2.382392
H  4.677067 0.759469 -2.146164
H  3.018936 1.34284 -1.789292
H  5.861476 -0.709056 -0.355112
H  5.159368 -0.385876 1.260456
H  5.659235 0.980888 0.216898
