program: Gaussian 09
title: 000292652
version: EM64L-G09RevD.01
frameworkgroup: C1[X(C14H17NO2)]
method: RPBEPBE
basis: SDD
operation: Freq
keyword: #p
keyword: freq=noraman
keyword: PBEPBE/SDD
title: #p freq=noraman PBEPBE/SDD
converged: YES YES NO NO
title: Mulliken charges:
elementType: O O N C C C C C C C C C C C C C C H H H H H H H H H H H H H H H H H
charge: -0.266170 -0.253681 -0.409388 -0.559630 0.405356 -0.391439 0.104416 0.222878 -0.518790 -0.449454 -0.420925 -0.356809 -0.262774 0.258691 -0.216937 -0.228770 -0.672517 0.230713 0.202074 0.243428 0.216888 0.240309 0.252078 0.264943 0.300100 0.278034 0.222993 0.218944 0.217587 0.227671 0.228854 0.211760 0.229818 0.229753
chargesum: 0.00000
title: Mulliken charges with hydrogens summed into heavy atoms:
elementType: O O N C C C C C C C C C C C C C C
charge: -0.266170 -0.253681 -0.109288 -0.126843 0.405356 0.068876 0.104416 0.222878 -0.026404 -0.184511 -0.142891 -0.133816 -0.043830 0.258691 0.000651 0.227755 -0.001186
polarizability: 2.08476132e+02 6.09757695e+00 1.84107561e+02 3.21583542e+00 7.71535130e+00 9.57458839e+01
1716.lowfreq: -12.9346 -5.7086 -3.2829 -0.0003 0.0004 0.0007 16.9952 21.3853 41.9435
frequency: 16.8091 21.0820 41.9408 57.8395 78.8451 90.7761 144.2147 148.8030 195.0722 218.2569 227.6603 237.4291 253.5030 303.6456 346.5981 373.5209 428.3070 452.2011 462.5944 489.1071 533.8811 547.3227 575.3716 582.5328 630.8870 639.5902 727.8337 744.2334 752.3746 769.1286 770.8444 793.7489 798.8427 816.0000 857.1143 860.7843 868.3054 887.5304 940.1391 981.3931 1000.5411 1012.0931 1019.9187 1035.1553 1059.1377 1082.7827 1091.9130 1111.6004 1120.6636 1133.5710 1135.8934 1164.9298 1174.8766 1197.3373 1235.1470 1249.4525 1252.3840 1275.2127 1296.5889 1304.0122 1335.2458 1351.0243 1353.3882 1360.8459 1389.7637 1400.5202 1420.2996 1437.7741 1457.9647 1462.4306 1463.9752 1473.7137 1474.0724 1481.0366 1486.6362 1566.5436 1587.8407 1630.6824 1632.6522 2974.3017 2989.2712 2995.4453 3005.8772 3009.8078 3025.3268 3045.2829 3068.0619 3072.1825 3092.3144 3107.1645 3119.7805 3127.9979 3141.0694 3158.6919 3216.5688 3614.8413
redmass: 4.0093 4.7803 2.9629 4.3152 4.3956 3.8009 2.6160 2.9098 3.2221 3.9013 2.3441 2.5593 1.2665 4.4447 3.5197 4.8470 2.9585 3.5268 3.7673 1.2131 5.0413 3.1415 3.1824 4.5708 3.0722 3.3044 3.7214 2.7669 1.2930 2.0777 4.0584 1.6205 1.0981 3.0852 1.9642 1.7250 4.9970 3.2419 1.3615 1.2910 2.0651 2.1869 2.3005 2.9444 2.6251 3.0322 1.6512 2.2149 2.1377 1.5535 1.4775 1.3167 1.2990 1.2703 2.0606 1.1357 1.5708 1.5326 1.2694 1.8110 1.4228 1.6298 1.5304 1.4999 5.1420 1.2684 2.4919 1.0907 1.6711 1.6960 1.0404 1.0982 1.0604 3.0605 1.0695 6.3157 6.2319 6.7195 9.1781 1.0591 1.0618 1.0358 1.0642 1.0582 1.0985 1.0982 1.1066 1.1019 1.0986 1.1026 1.0849 1.0896 1.0956 1.1001 1.0981 1.0808
irintensity: 0.9423 0.2793 0.1001 0.8332 1.1073 0.1046 6.5245 5.4411 1.2561 6.9592 1.8052 1.8511 1.4734 12.6558 5.0471 1.0520 12.6177 7.8200 3.7640 95.6384 0.2605 0.6800 6.5852 6.0470 0.4673 0.0803 0.7938 7.0502 119.5292 2.1138 7.0833 14.9068 4.6053 2.9330 4.7720 7.6382 4.8405 15.5198 3.9290 0.6819 1.4842 14.5723 34.1114 33.2803 2.8578 29.8014 90.8172 52.0550 182.4488 34.9372 11.0687 88.4947 59.3843 3.5137 18.0530 0.0421 5.7130 5.3940 5.8493 2.4646 45.8382 21.2784 4.0273 8.0880 31.4580 19.1739 2.1032 35.4180 9.6839 16.5499 12.3171 12.7977 7.3731 2.1517 13.2197 4.8658 0.5008 1.9738 181.0007 33.8211 25.7944 24.8159 24.5406 17.4412 14.0639 11.3396 8.2141 30.9087 29.1592 45.3432 0.1000 10.2491 20.9428 35.4784 2.0830 56.9363
temp: 298.150 k
press: 1.00000 atm
elementType: 8 8 7 6 6 6 6 6 6 6 6 6 6 6 6 6 6 1 1 1 1 1 1 1 1 1 1 1 1 1 1 1 1 1
symmnumber: 1
zpe: 736598.6 jmol-1
zpe.correction: 0.280556 hartree
zpe.thermalcorrener: 0.297047 hartree
zpe.thermalcorrenthalpy: 0.297991 hartree
zpe.thermalcorrgfe: 0.233721 hartree
zpe.sumelectzpe: -747.652328 hartree
zpe.sumelectthermal: -747.635836 hartree
zpe.sumelectthermalent: -747.634892 hartree
zpe.sumelectthermalfe: -747.699163 hartree
dipole: -0.8475 -2.4910 -0.2069
dipole: 2.6393
quadrupole: -74.2094 -92.3735 -103.3948
quadrupole: -10.6388 0.1930 0.6886
quadrupole: 15.7832 -2.3809 -13.4023 -10.6388 0.1930 0.6886
hfenergy: -747.9328833 hartree
pointgroup: C01 [X(C14H17N1O2)]
dipole: 0.3875583 -0.9623216 0.0448226 debye
polarizability: 209.0066803|-4.8041716|183.9763049|4.5346952|-3.8685021|95.3465922 unknown
InChI: InChI=1S/C14H17NO2/c1-2-17-14(16)9-5-6-11-10-15-13-8-4-3-7-12(11)13/h3-4,7-8,10,15H,2,5-6,9H2,1H3
charge 0 multiplicity 1
34 atoms
O  4.286311 0.004136 -0.023102
O  2.237734 1.10585 -0.111466
N  -3.500211 -1.748423 0.332129
C  0.25325 -1.527835 0.346096
C  -1.244463 -1.350124 0.319568
C  0.910697 -1.308315 -1.046618
C  -1.945224 -0.084218 0.158331
C  -3.357503 -0.364774 0.169887
C  2.447598 -1.213877 -0.975978
C  -2.225347 -2.335337 0.423709
C  -1.505789 1.260363 0.016514
C  -4.330876 0.651207 0.040909
C  -2.47296 2.2764 -0.110948
C  2.926379 0.081184 -0.332912
C  -3.868532 1.975838 -0.100796
C  4.897831 1.231801 0.577379
C  6.365217 0.908682 0.838672
H  0.691297 -0.799931 1.057366
H  0.514923 -2.538141 0.717246
H  0.511593 -0.379943 -1.492696
H  0.623612 -2.138375 -1.719395
H  2.887748 -2.063269 -0.420302
H  2.888233 -1.25463 -1.992208
H  -2.112367 -3.409998 0.558685
H  -4.384168 -2.248224 0.388506
H  -0.435366 1.497936 0.009327
H  -5.403884 0.427541 0.051021
H  -2.153418 3.318934 -0.22022
H  -4.594346 2.790747 -0.203344
H  4.76642 2.067926 -0.1333
H  4.344609 1.477816 1.501765
H  6.8686 1.786364 1.283623
H  6.463618 0.060298 1.537311
H  6.884785 0.648491 -0.099359
