program: Gaussian 09
title: 000292648
version: EM64L-G09RevD.01
frameworkgroup: C1[X(C14H13NO3)]
method: RPBEPBE
basis: SDD
operation: Freq
keyword: #p
keyword: freq=noraman
keyword: PBEPBE/SDD
title: #p freq=noraman PBEPBE/SDD
converged: YES YES NO NO
title: Mulliken charges:
elementType: O O O N C C C C C C C C C C C C C C H H H H H H H H H H H H H
charge: -0.287077 -0.207813 -0.198464 0.011102 0.165642 0.288968 -0.428236 0.263105 0.452501 -0.363540 -0.774106 -0.381850 -0.215248 -0.442039 -0.368176 -0.220244 -0.219906 -0.235956 0.225329 0.224412 0.259620 0.241329 0.254601 0.260796 0.282733 0.237264 0.231366 0.251259 0.230082 0.230298 0.232249
chargesum: 0.00000
title: Mulliken charges with hydrogens summed into heavy atoms:
elementType: O O O N C C C C C C C C C C C C C C
charge: -0.287077 -0.207813 -0.198464 0.011102 0.165642 0.288968 0.021505 0.263105 0.452501 -0.103920 -0.017380 -0.099117 0.022016 -0.210673 -0.116917 0.009838 0.010392 -0.003707
polarizability: 2.50361014e+02 -8.36041785e+00 1.78530371e+02 7.87035951e+00 9.34873240e+00 8.84251731e+01
1716.lowfreq: -9.5110 -2.8619 -0.0004 -0.0002 0.0003 1.2516 15.3217 26.6173 46.0950
frequency: 15.3208 26.5046 46.0644 53.6155 77.4479 120.1234 164.4069 179.7466 194.7987 204.8601 248.8777 274.2352 296.1407 361.5669 382.9298 401.4398 415.5946 475.1043 484.3119 510.1783 536.6452 570.8103 589.5234 616.2020 643.1251 690.7465 701.8138 710.9497 734.4207 749.5569 796.6887 804.2129 825.7386 853.5497 856.0268 893.9833 917.1650 972.6358 973.5261 978.7605 990.3502 997.1245 1007.3035 1026.9159 1033.6489 1038.5907 1086.4062 1088.4918 1157.4300 1173.7842 1187.3127 1191.0513 1200.2526 1208.9525 1213.9701 1223.4052 1245.1611 1318.4822 1351.9990 1364.9333 1380.1174 1390.0616 1403.4570 1428.1167 1441.6249 1461.2794 1466.9371 1471.5940 1480.1451 1487.6801 1586.9771 1596.0283 1598.4860 1618.3661 2944.9296 3005.5004 3009.8125 3082.7328 3118.9698 3129.2131 3130.2349 3142.9663 3151.2508 3155.1966 3167.9700 3173.5096 3194.2352
redmass: 3.9190 6.4492 7.0878 5.6528 4.1483 4.2340 5.4174 1.1019 4.1482 6.5011 3.9655 4.0373 3.5029 5.3012 4.3286 2.8172 4.8767 3.5208 4.1710 5.7341 4.3163 5.0922 5.5655 6.4414 7.1836 3.9549 2.0604 2.8399 4.7295 1.8554 1.8232 4.9697 3.9556 1.9297 2.0474 1.4125 1.3681 1.5040 2.7897 1.4162 5.9370 1.3709 1.6688 2.1395 2.0145 1.5359 1.9957 1.6070 2.2091 1.0554 1.1578 1.6533 1.1786 2.5267 6.5665 2.0802 2.4570 1.3350 1.7770 5.1913 5.6838 3.8527 1.2647 2.2522 2.1592 1.3508 1.4270 1.0892 1.7059 2.0872 6.4183 6.4195 6.9330 6.1007 1.0574 1.0384 1.1040 1.0951 1.0875 1.1001 1.0867 1.0918 1.0877 1.0959 1.1014 1.0939 1.0962
irintensity: 0.6222 0.0658 0.4236 0.2380 0.6271 6.3707 3.4107 1.5106 0.7208 0.7893 2.0299 0.4280 3.2455 1.8361 0.4561 1.1018 2.6274 3.3936 6.3898 1.1322 3.2988 3.0631 5.7923 0.1854 6.8136 1.1186 40.7971 32.4512 22.2868 72.0990 57.9102 11.7964 11.9731 5.1978 3.0863 0.7869 5.3576 18.5980 66.0185 3.4282 0.2007 0.6589 0.4011 12.8643 30.8787 10.1622 17.8691 3.2505 43.2263 0.4773 19.7666 17.0529 9.3101 229.3885 255.3952 7.0419 100.2495 9.3474 7.1247 110.7438 44.9877 6.0901 20.4490 15.6903 10.2567 25.1367 96.2906 22.5970 13.8613 25.6372 6.1558 11.0392 26.7790 1.3123 29.1748 5.2110 25.6546 9.5124 8.0242 8.6046 0.2259 19.7502 11.9989 33.2196 16.0630 8.8889 5.0199
temp: 298.150 k
press: 1.00000 atm
elementType: 8 8 8 7 6 6 6 6 6 6 6 6 6 6 6 6 6 6 1 1 1 1 1 1 1 1 1 1 1 1 1
symmnumber: 1
zpe: 626079.4 jmol-1
zpe.correction: 0.238461 hartree
zpe.thermalcorrener: 0.254369 hartree
zpe.thermalcorrenthalpy: 0.255313 hartree
zpe.thermalcorrgfe: 0.192366 hartree
zpe.sumelectzpe: -820.334617 hartree
zpe.sumelectthermal: -820.318709 hartree
zpe.sumelectthermalent: -820.317765 hartree
zpe.sumelectthermalfe: -820.380712 hartree
dipole: 5.6216 3.6241 -0.6517
dipole: 6.7202
quadrupole: -119.9477 -96.4881 -106.0300
quadrupole: -11.0671 4.2472 1.4614
quadrupole: -12.4591 11.0005 1.4586 -11.0671 4.2472 1.4614
hfenergy: -820.5730778 hartree
pointgroup: C01 [X(C14H13N1O3)]
dipole: 2.1076031 1.2298722 1.0177333 debye
polarizability: 248.3733574|-17.6081558|130.0637395|14.4838677|44.0349465|138.8794615 unknown
InChI: InChI=1S/C14H13NO3/c1-11-13(15(16)17)8-5-9-14(11)18-10-12-6-3-2-4-7-12/h2-9H,10H2,1H3
charge 0 multiplicity 1
31 atoms
O  0.512737 0.084498 0.137681
O  -5.394553 -0.576827 -0.671231
O  -3.861416 -1.504297 -2.072262
N  -4.180866 -0.72697 -1.091395
C  -1.755511 -0.34814 -0.476169
C  -0.823147 0.505605 0.199754
C  1.541091 0.927505 0.784773
C  -3.114582 0.061468 -0.416413
C  2.896356 0.308336 0.515697
C  -1.236547 1.676114 0.88017
C  -1.24819 -1.603004 -1.15724
C  -3.55529 1.222288 0.267223
C  -2.604435 2.028661 0.90915
C  3.869414 0.263837 1.54319
C  3.222126 -0.189443 -0.770825
C  5.158137 -0.258106 1.287522
C  4.50532 -0.720894 -1.023506
C  5.479165 -0.751976 0.002866
H  1.344593 0.991607 1.873784
H  1.478171 1.949628 0.353636
H  -0.50939 2.312208 1.39121
H  -1.902526 -2.46742 -0.956875
H  -1.240357 -1.477886 -2.254582
H  -0.226263 -1.824807 -0.817842
H  -4.620961 1.459738 0.278809
H  -2.920385 2.935012 1.434814
H  3.622261 0.633207 2.546361
H  2.462866 -0.173749 -1.559771
H  5.903763 -0.287241 2.089652
H  4.747123 -1.109598 -2.018946
H  6.475498 -1.162156 -0.195735
