program: Gaussian 09
title: 000292640
version: EM64L-G09RevD.01
frameworkgroup: C1[X(C6H7BrO4)]
method: RPBEPBE
basis: SDD
operation: Freq
keyword: #p
keyword: freq=noraman
keyword: PBEPBE/SDD
title: #p freq=noraman PBEPBE/SDD
converged: YES YES NO NO
title: Mulliken charges:
elementType: Br O O O O C C C C C C H H H H H H H
charge: -0.003487 -0.255401 -0.236769 -0.417257 -0.231324 -0.214031 -0.666571 0.273427 -0.255288 -0.221417 0.182323 0.243912 0.267780 0.276393 0.295053 0.289240 0.288100 0.385317
chargesum: 0.00000
title: Mulliken charges with hydrogens summed into heavy atoms:
elementType: Br O O O O C C C C C C
charge: -0.003487 -0.255401 -0.236769 -0.031941 -0.231324 0.297660 -0.095125 0.273427 0.033953 0.066684 0.182323
polarizability: 1.39881022e+02 5.07526854e+00 9.00993070e+01 7.05893288e+00 -6.58913796e-01 6.20423858e+01
1716.lowfreq: -4.9586 -4.4450 -0.0007 0.0002 0.0003 2.8167 16.3897 34.0844 47.4858
frequency: 15.3777 34.0681 47.4831 81.5689 107.5989 157.5849 184.1419 206.9569 250.2789 268.5130 326.8424 405.8755 505.6995 538.3030 568.7792 575.5613 648.6593 706.4029 727.5188 787.9209 902.8042 919.1708 930.9416 957.7346 970.3960 1010.4869 1056.5458 1077.3203 1128.3546 1166.1931 1209.5770 1222.7273 1272.4997 1285.5361 1327.1535 1361.0680 1432.7864 1451.7695 1618.7143 1638.3623 1663.5551 2989.1628 3063.8219 3077.0276 3149.5370 3164.0868 3168.7542 3522.7836
redmass: 8.4530 10.7725 9.5407 4.9429 7.6657 3.3209 4.8577 3.6610 3.8093 3.9858 5.6500 3.5110 4.1471 3.8088 1.7724 5.8378 1.8307 5.8586 8.7194 2.5999 3.3737 2.1431 2.7107 3.0614 1.9265 1.0867 2.2237 2.3364 2.8909 1.2329 1.1860 1.4073 1.2025 1.5675 2.2638 1.4779 1.1130 1.0768 10.9678 8.7638 6.6545 1.0624 1.0629 1.0949 1.1097 1.0981 1.0883 1.0642
irintensity: 0.3421 0.8909 3.8812 2.9885 0.4466 0.0402 5.8420 1.1734 3.2944 4.9362 13.8239 11.5637 39.2396 9.8394 76.3578 38.8493 77.6943 3.0022 40.0201 0.5324 19.7809 0.3478 72.0502 22.7340 58.6531 57.4941 265.5590 5.6401 324.4112 0.3889 0.7440 87.3639 61.5707 150.9934 183.2307 10.0850 11.4078 15.4619 197.1699 153.7639 1.3227 13.9708 10.0789 12.2071 4.3440 0.0993 0.9373 53.8245
temp: 298.150 k
press: 1.00000 atm
elementType: 35 8 8 8 8 6 6 6 6 6 6 1 1 1 1 1 1 1
symmnumber: 1
zpe: 328279.3 jmol-1
zpe.correction: 0.125035 hartree
zpe.thermalcorrener: 0.137045 hartree
zpe.thermalcorrenthalpy: 0.137989 hartree
zpe.thermalcorrgfe: 0.082572 hartree
zpe.sumelectzpe: -546.343668 hartree
zpe.sumelectthermal: -546.331659 hartree
zpe.sumelectthermalent: -546.330714 hartree
zpe.sumelectthermalfe: -546.386131 hartree
dipole: 0.0936 1.7078 1.2671
dipole: 2.1286
quadrupole: -60.4348 -78.7947 -73.0495
quadrupole: 8.4316 5.7532 6.6834
quadrupole: 10.3249 -8.0350 -2.2898 8.4316 5.7532 6.6834
hfenergy: -546.4687034 hartree
pointgroup: C01 [X(C6H7Br1O4)]
dipole: 0.1739473 0.5786985 0.579806 debye
dipolederiv: -0.169173 0.0545322 0.0126225 0.1412601 -0.3341728 -0.1166452 0.0835942 -0.1821565 -0.2450546 -1.7004775 0.3320714 -0.1550638 0.2734187 -0.4965484 0.1123232 -0.2420106 0.1523598 -0.3226419 -0.7186242 -0.0782463 0.027482 0.0812631 -0.8288845 0.1888487 -0.079519 0.2090695 -0.3816705 -1.2007442 0.4443112 -0.2510211 0.3654299 -0.4615671 0.0525179 -0.2354171 0.0619112 -0.4789178 -0.7298175 -0.126524 0.0221761 -0.1016132 -0.8401659 0.2224294 -0.0017811 0.2075887 -0.4120858 0.9444672 -0.078257 -0.0137597 0.2300728 0.065675 -0.0126878 0.039379 -0.0644073 0.1978231 0.0726274 -0.0785905 -0.0647137 -0.1915146 0.4953354 0.3147505 -0.1567819 0.3464569 0.357851 1.9792742 -0.1382064 0.1170207 -0.2447955 1.0498252 -0.2992138 0.2979036 -0.356725 0.3846863 -0.3778615 -0.0827969 0.0221251 -0.1344352 -0.0117308 -0.0563787 0.0203144 -0.0393655 -0.0748676 -0.5066297 -0.0890957 0.0123652 -0.2146515 0.0052997 -0.0487998 0.0478095 -0.0500294 -0.0705651 1.9341365 -0.1132326 0.190855 0.09589 1.0674906 -0.3534138 0.1389235 -0.3555291 0.4239405 -0.0998592 0.0944788 0.0367341 -0.0506829 -0.0296196 -0.1083738 -0.0322509 -0.0828946 0.0216126 -0.0349447 0.0170288 -0.0240858 -0.0740236 0.0892065 0.0441402 0.0189889 0.0655047 -0.0319576 -0.063605 -0.0324526 -0.0056059 -0.046651 -0.0309796 -0.083308 0.0059664 -0.0817565 0.0501947 0.1218747 -0.0083548 0.0522825 0.0522534 -0.0101824 -0.0370314 0.0380382 -0.0135975 -0.0972882 0.1090459 -0.0063435 -0.0050556 -0.0210091 0.0385605 0.0519797 0.0052223 0.0522944 0.1502899 0.1135702 -0.0156921 -0.0033902 -0.0298619 0.0366363 0.0544013 0.0044455 0.0541676 0.150834 0.3267403 -0.09463 0.0290327 -0.1303497 0.195822 0.0744615 0.0471753 0.0771085 0.377817 unknown
polarizability: 140.6857412|-3.7523889|89.6801811|2.097807|2.4849567|61.6567926 unknown
InChI: InChI=1S/C6H7BrO4/c7-3-4-11-6(10)2-1-5(8)9/h1-2,8H,3-4H2
charge 0 multiplicity 1
18 atoms
Br 4.148267 -1.71728 -0.895593
O  1.588316 0.02308 0.382052
O  0.519953 1.904774 -0.504804
O  -4.347258 0.305937 -0.352024
O  -3.272918 -1.556918 0.546986
C  2.891297 0.711241 0.206744
C  3.987662 -0.286939 0.526622
C  0.461284 0.743935 -0.032325
C  -0.760362 -0.071636 0.18034
C  -1.989314 0.414206 -0.145207
C  -3.21138 -0.400496 0.066457
H  2.935126 1.561717 0.916839
H  2.962096 1.113084 -0.818823
H  4.970817 0.207182 0.552767
H  3.795677 -0.825519 1.466109
H  -0.64011 -1.074722 0.603135
H  -2.108557 1.415494 -0.571958
H  -5.157995 -0.253141 -0.205914
