program: Gaussian 09
title: 000292644
version: EM64L-G09RevD.01
frameworkgroup: C1[X(C12H17NO2S)]
method: RPBEPBE
basis: SDD
operation: Freq
keyword: #p
keyword: freq=noraman
keyword: PBEPBE/SDD
title: #p freq=noraman PBEPBE/SDD
converged: YES YES NO NO
title: Mulliken charges:
elementType: S O O N C C C C C C C C C C C C H H H H H H H H H H H H H H H H H
charge: 0.222174 -0.368407 -0.283018 -0.594285 -0.385095 -0.380112 -0.560170 -0.373508 0.544339 -0.492139 -0.375247 0.080992 -0.261776 0.207813 -0.250800 -0.662195 0.206237 0.200588 0.200176 0.182292 0.282199 0.195759 0.199214 0.209301 0.215920 0.206847 0.381796 0.310632 0.241400 0.211746 0.213727 0.218159 0.255441
chargesum: 0.00000
title: Mulliken charges with hydrogens summed into heavy atoms:
elementType: S O O N C C C C C C C C C C C C
charge: 0.222174 -0.368407 -0.283018 0.098142 0.021730 0.002356 -0.082211 0.035006 0.544339 -0.069372 -0.375247 0.080992 -0.261776 0.207813 0.202346 0.025132
polarizability: 2.12344256e+02 -2.86398226e+00 1.75631308e+02 -8.57628012e+00 -3.44205553e+00 9.86556513e+01
1716.lowfreq: -10.1271 -6.2400 -0.0019 -0.0013 0.0021 5.7877 36.5096 43.9707 63.5682
frequency: 36.4896 43.8870 63.5648 80.8552 98.6510 136.4276 148.5865 187.5605 204.3540 230.7432 248.9679 282.0610 309.5814 327.0151 340.1190 347.7021 353.3714 376.3088 382.0614 423.7171 459.5001 486.6396 491.1251 549.1901 560.0490 625.8934 656.3929 678.6568 695.5905 742.2335 760.9332 769.5602 812.0151 818.2021 821.3746 874.8467 893.0487 917.8019 953.5415 970.0064 1013.7335 1029.6514 1070.8902 1083.1220 1096.3382 1107.9379 1132.8630 1138.5292 1151.5580 1192.8843 1212.0490 1224.8654 1265.9517 1271.2205 1280.6465 1302.4109 1323.3210 1334.2600 1345.2504 1352.6699 1355.1639 1366.8205 1387.8218 1403.8344 1453.5624 1455.1834 1457.5476 1461.9067 1463.0746 1465.2309 1476.3945 1484.1082 1522.0678 1590.9641 1599.5046 1616.9205 2948.0887 2952.0414 2957.6305 2971.1670 2972.4824 2990.8812 3011.5790 3027.0299 3027.8992 3030.1315 3038.4017 3077.5004 3082.9560 3091.8444 3116.2836 3437.4441 3663.1276
redmass: 3.4731 3.4152 3.4014 4.4820 4.6374 2.8643 4.1500 2.1285 2.0973 1.7596 3.6619 3.5555 3.3868 2.4770 2.8347 1.3521 2.8590 6.4808 2.9217 3.5442 2.4947 4.5231 3.0323 4.0389 4.3583 5.6084 1.2727 3.7417 2.9838 6.9007 2.8976 2.5625 1.5046 1.6325 2.3479 1.9384 2.7686 3.1463 2.1118 2.1507 2.5164 3.7736 2.1889 2.3793 2.1383 2.1581 2.4159 1.3769 1.6615 2.4862 1.2068 1.3380 1.1853 1.2621 1.1167 2.1451 1.4513 1.5500 1.3813 1.4145 1.4798 1.6639 1.2363 3.9960 1.0988 1.1065 1.0880 1.0456 1.0882 1.0901 1.0945 1.0515 2.3573 1.8127 7.0472 7.8942 1.0664 1.0612 1.0694 1.0630 1.0620 1.0363 1.0965 1.0937 1.0587 1.1015 1.1017 1.0909 1.0996 1.1022 1.1048 1.0521 1.0970
irintensity: 1.4644 1.7137 0.6519 0.9797 0.2925 1.8735 1.4897 2.3272 3.1120 1.6815 1.1888 4.6201 3.7904 6.7527 20.4551 106.2158 14.6294 6.9814 4.1105 3.1515 2.3658 5.5426 0.2787 3.8070 41.9018 0.5694 83.5109 8.4603 5.8969 16.6239 1.7719 48.7301 9.9536 5.8568 4.3829 0.7770 15.1995 46.1867 30.6874 18.8703 2.7591 333.5379 9.9498 30.8574 14.9107 21.5205 6.0162 0.3599 11.5611 13.2884 12.4364 8.5581 7.2259 17.4774 2.9906 14.6758 4.5039 8.6590 33.0177 4.0525 0.7593 26.9502 33.1189 161.7798 10.5384 40.7654 9.6524 19.8779 6.8927 10.9835 26.6781 15.1753 31.0622 242.6103 134.4252 320.9121 35.9608 33.8945 23.5926 52.5298 40.7005 25.4521 83.4150 42.2401 40.9835 9.4050 97.5314 7.1301 30.4038 13.0346 28.6315 144.7698 87.6490
temp: 298.150 k
press: 1.00000 atm
elementType: 16 8 8 7 6 6 6 6 6 6 6 6 6 6 6 6 1 1 1 1 1 1 1 1 1 1 1 1 1 1 1 1 1
symmnumber: 1
zpe: 712049.5 jmol-1
zpe.correction: 0.271205 hartree
zpe.thermalcorrener: 0.287612 hartree
zpe.thermalcorrenthalpy: 0.288556 hartree
zpe.thermalcorrgfe: 0.227041 hartree
zpe.sumelectzpe: -1069.527800 hartree
zpe.sumelectthermal: -1069.511394 hartree
zpe.sumelectthermalent: -1069.510450 hartree
zpe.sumelectthermalfe: -1069.571965 hartree
dipole: 1.2166 2.3364 -0.4173
dipole: 2.6671
quadrupole: -83.7297 -100.0713 -104.6259
quadrupole: 6.6021 -3.2524 -1.5370
quadrupole: 12.4126 -3.9290 -8.4836 6.6021 -3.2524 -1.5370
hfenergy: -1069.7990056 hartree
pointgroup: C01 [X(C12H17N1O2S1)]
dipole: -0.4867205 0.8540479 0.3670603 debye
polarizability: 211.1630125|6.4076978|171.4251833|-12.9243351|17.8749416|104.0430194 unknown
InChI: InChI=1S/C12H17NO2S/c1-2-15-12(14)10-8-6-4-3-5-7-9(8)16-11(10)13/h2-7,13H2,1H3
charge 0 multiplicity 1
33 atoms
S  0.920615 2.572953 0.640834
O  -2.909771 0.073288 0.828053
O  -1.728323 -1.7503 -0.0248
N  -1.758801 2.408574 1.232685
C  2.353439 -2.027587 0.237007
C  3.771643 -1.456825 -0.014575
C  1.211148 -1.367689 -0.584205
C  4.005958 0.003776 0.439878
C  0.789772 0.008883 -0.086523
C  3.170621 1.05882 -0.337079
C  1.700437 1.040132 0.001152
C  -0.569856 0.375268 0.348616
C  -0.664032 1.725861 0.769711
C  -1.705681 -0.543254 0.340684
C  -4.129341 -0.783897 0.819166
C  -4.827703 -0.730109 -0.543065
H  2.110176 -1.963014 1.316202
H  2.371862 -3.106447 -0.01784
H  4.508438 -2.105005 0.502036
H  3.998687 -1.533563 -1.099622
H  0.329578 -2.027844 -0.57656
H  1.542475 -1.28809 -1.641525
H  5.079384 0.245018 0.300775
H  3.790605 0.099375 1.522087
H  3.304901 0.882113 -1.426134
H  3.585992 2.064583 -0.136272
H  -2.630676 1.872281 1.290603
H  -1.703054 3.383108 1.514155
H  -3.829765 -1.814975 1.073075
H  -4.755593 -0.362991 1.623799
H  -5.768076 -1.311447 -0.506233
H  -5.074626 0.309214 -0.822021
H  -4.182729 -1.16581 -1.323765
