program: Gaussian 09
title: 000292685
version: EM64L-G09RevD.01
frameworkgroup: C1[X(C15H17NO)]
method: RPBEPBE
basis: SDD
operation: Freq
keyword: #p
keyword: freq=noraman
keyword: PBEPBE/SDD
title: #p freq=noraman PBEPBE/SDD
converged: YES YES NO NO
title: Mulliken charges:
elementType: O N C C C C C C C C C C C C C C C H H H H H H H H H H H H H H H H H
charge: -0.268662 -0.418515 -0.140455 -0.444646 -0.451445 -0.414725 -0.402085 -0.390251 0.411555 0.213155 -0.453898 0.264961 -0.379482 0.035438 -0.396133 -0.292756 -0.217247 0.196123 0.216570 0.186000 0.212851 0.229008 0.192788 0.205345 0.206246 0.190233 0.195324 0.202253 0.252558 0.238643 0.326985 0.231437 0.230626 0.232201
chargesum: 0.00000
title: Mulliken charges with hydrogens summed into heavy atoms:
elementType: O N C C C C C C C C C C C C C C C
charge: -0.268662 -0.091530 0.055668 -0.042077 -0.009587 -0.016592 -0.005606 0.007326 0.411555 0.213155 -0.201340 0.264961 -0.140839 0.035438 -0.164696 -0.062130 0.014954
polarizability: 2.05708533e+02 -9.38357283e+00 2.13511642e+02 4.37181995e+00 5.65242535e+00 9.84543711e+01
1716.lowfreq: -9.8177 0.0004 0.0005 0.0007 6.4757 10.0656 47.2560 65.6543 93.7437
frequency: 47.1546 65.6128 93.7290 110.5884 168.1633 189.1246 224.2932 232.0315 256.0752 289.9792 317.7783 339.9083 416.3422 433.4277 443.1292 446.3828 486.7981 489.5406 528.2012 568.2161 606.2831 633.3722 653.2646 686.7640 733.3587 754.8912 763.7828 772.4671 786.6866 791.1783 843.9850 859.9552 868.6053 881.7225 896.6095 897.7807 922.7958 944.7628 947.0298 977.0381 980.5383 1039.7195 1047.0937 1048.5945 1063.4601 1076.7245 1111.1280 1134.0808 1146.4947 1176.2698 1183.8138 1206.5285 1232.3001 1248.8464 1259.1675 1261.8627 1274.1477 1288.4812 1295.0318 1312.0082 1319.8486 1334.9967 1340.8321 1344.4671 1352.7346 1378.7630 1396.0532 1408.9911 1457.7811 1460.3593 1461.3011 1465.8930 1472.4786 1479.4619 1493.3421 1548.5726 1593.9520 1618.8553 1650.1990 2951.3238 2963.0097 2966.9594 2969.3422 2971.1605 2979.1506 3028.3116 3030.5054 3035.5285 3040.4403 3048.1199 3124.6097 3140.1420 3153.5936 3170.8827 3186.8642 3512.2957
redmass: 3.2908 3.7558 3.6598 6.0620 3.8398 3.1178 4.1769 2.5917 3.1763 3.8977 3.1545 2.6051 2.8035 2.9810 6.7925 3.0041 5.7812 1.7908 3.3040 4.4971 3.8286 3.8895 2.0191 3.9807 1.8969 4.2482 1.8403 2.2903 1.8815 1.8015 2.3132 1.6013 1.8041 2.4009 1.4352 2.0567 1.9935 1.3843 3.6526 2.8691 1.3235 2.0541 2.3087 1.8733 1.3548 1.4975 2.4052 2.1009 1.6631 1.1584 1.4221 2.2255 1.3659 1.5526 1.3260 1.3897 1.9316 1.5538 1.6625 1.3001 1.3478 1.3684 1.5455 1.5379 1.5733 2.0834 2.2593 4.2124 2.9135 1.1114 1.0922 1.0975 1.0879 1.0942 2.6314 7.4423 5.6494 6.5834 5.7937 1.0794 1.0643 1.0637 1.0624 1.0616 1.0632 1.0963 1.0955 1.1009 1.1018 1.1029 1.0876 1.0876 1.0937 1.1001 1.0912 1.0766
irintensity: 0.5336 0.4472 0.4870 1.6043 0.3601 0.0766 0.9236 0.3293 1.6639 3.4999 1.0412 1.7835 2.7234 0.3748 4.9144 5.9912 9.1027 0.2136 4.9128 4.2286 5.0594 10.3685 8.4570 4.5732 12.3423 6.1152 89.5384 43.4453 8.0021 1.3250 6.1143 13.6436 5.9463 15.1900 3.4226 8.4503 0.8846 2.7068 11.5470 13.7222 0.3799 7.5886 2.2243 1.1861 0.0375 0.5554 0.0346 6.5257 0.8338 3.9554 1.3904 5.6338 1.0621 14.3542 3.7395 6.7718 1.8622 9.9327 16.4879 0.4427 2.3003 0.7876 15.6726 15.8020 17.8030 15.2254 16.2463 17.8786 10.3247 5.8528 5.7523 7.8494 21.1465 2.9689 8.4697 24.5372 71.5012 6.2717 526.0295 6.5039 34.9983 37.2511 31.9549 15.2241 30.0273 75.7497 78.8465 6.2673 19.8841 99.8217 6.3792 2.4016 28.1983 21.2066 1.6776 32.4294
temp: 298.150 k
press: 1.00000 atm
elementType: 8 7 6 6 6 6 6 6 6 6 6 6 6 6 6 6 6 1 1 1 1 1 1 1 1 1 1 1 1 1 1 1 1 1
symmnumber: 1
zpe: 751292.1 jmol-1
zpe.correction: 0.286152 hartree
zpe.thermalcorrener: 0.300105 hartree
zpe.thermalcorrenthalpy: 0.301049 hartree
zpe.thermalcorrgfe: 0.245487 hartree
zpe.sumelectzpe: -710.574652 hartree
zpe.sumelectthermal: -710.560699 hartree
zpe.sumelectthermalent: -710.559755 hartree
zpe.sumelectthermalfe: -710.615318 hartree
dipole: -0.7954 -4.7658 -0.3152
dipole: 4.8419
quadrupole: -85.5858 -115.0840 -104.1953
quadrupole: -8.8379 0.6645 -0.6269
quadrupole: 16.0359 -13.4623 -2.5736 -8.8379 0.6645 -0.6269
hfenergy: -710.8608043 hartree
pointgroup: C01 [X(C15H17N1O1)]
dipole: 0.184384 1.7494181 0.7310595 debye
polarizability: 204.1997793|-1.4308028|192.9707152|-20.0726422|42.4754274|120.5040522 unknown
InChI: InChI=1S/C15H17NO/c17-15-10-13(11-6-2-1-3-7-11)12-8-4-5-9-14(12)16-15/h4-5,8-11,16H,1-3,6-7H2
charge 0 multiplicity 1
34 atoms
O  -1.473722 -3.514268 -1.282716
N  -2.36373 -1.588599 -0.313999
C  1.522463 0.355625 -0.409972
C  2.533087 -0.216304 -1.436641
C  2.150462 0.304023 1.020954
C  3.862278 0.574274 -1.400112
C  3.489669 1.076424 1.075981
C  4.488708 0.557832 0.014753
C  0.1517 -0.318335 -0.416292
C  -1.011739 0.394083 0.1317
C  -0.014907 -1.607423 -0.889771
C  -2.278344 -0.282126 0.169546
C  -0.963018 1.730531 0.626525
C  -1.289545 -2.327208 -0.863956
C  -3.433934 0.363577 0.687765
C  -2.105062 2.369311 1.136659
C  -3.346363 1.679665 1.168429
H  1.381983 1.427665 -0.667297
H  2.095966 -0.194156 -2.453567
H  2.750287 -1.277586 -1.199154
H  2.320021 -0.759155 1.287129
H  1.44205 0.708877 1.767788
H  3.674847 1.624496 -1.706882
H  4.571561 0.149149 -2.136096
H  3.928217 0.991482 2.089085
H  3.297258 2.155736 0.900314
H  4.782979 -0.481316 0.269235
H  5.413677 1.166065 0.030939
H  0.815422 -2.173758 -1.316532
H  -0.015487 2.277442 0.605524
H  -3.263081 -2.079311 -0.288445
H  -4.390681 -0.172233 0.70642
H  -2.04005 3.396871 1.508181
H  -4.23947 2.173847 1.565705
