program: Gaussian 09
title: 000292612
version: EM64L-G09RevD.01
frameworkgroup: C1[X(C15H11NO2)]
method: RPBEPBE
basis: SDD
operation: Freq
keyword: #p
keyword: freq=noraman
keyword: PBEPBE/SDD
title: #p freq=noraman PBEPBE/SDD
converged: NO NO NO NO
title: Mulliken charges:
elementType: O O N C C C C C C C C C C C C C C C H H H H H H H H H H H
charge: -0.268202 -0.186467 -0.053933 0.272526 0.099843 0.142662 0.061062 0.444195 -0.364420 -0.322344 -0.376909 -0.381485 0.131579 -0.331889 -0.351881 -0.235825 -0.200363 -0.806453 0.272487 0.275998 0.234779 0.235587 0.270626 0.264307 0.238816 0.237232 0.240693 0.228462 0.229316
chargesum: 0.00000
title: Mulliken charges with hydrogens summed into heavy atoms:
elementType: O O N C C C C C C C C C C C C C C C
charge: -0.268202 -0.186467 -0.053933 0.272526 0.099843 0.142662 0.061062 0.444195 -0.091933 -0.046346 -0.142130 -0.145898 0.131579 -0.061263 -0.087574 0.002991 0.036869 -0.107982
polarizability: 3.44932673e+02 1.03548319e+01 1.84359972e+02 7.36090910e-01 -3.23707130e-02 7.06569031e+01
1716.lowfreq: -5.9455 -0.0007 -0.0007 -0.0006 4.3202 8.8815 42.9743 44.8552 50.9907
frequency: 42.8737 44.8043 50.9852 90.1140 102.5475 141.7781 154.3808 238.7602 248.9074 268.4220 302.8466 328.9806 381.1190 406.5631 428.1575 467.7295 479.1374 495.7856 539.5080 543.2042 593.8556 625.9800 635.9398 665.3285 677.5091 705.7865 736.9902 777.4607 782.8757 786.0349 840.9835 845.9009 854.4026 859.4712 896.7058 902.5564 978.6191 985.5964 986.5092 995.9319 1001.0373 1003.4093 1022.0523 1028.8701 1047.1680 1100.0208 1123.8980 1167.6674 1185.5346 1196.1691 1224.5531 1229.2732 1254.8346 1308.0955 1315.5354 1373.4490 1386.1875 1398.7531 1413.1803 1450.1834 1458.5785 1469.5580 1473.5725 1502.5166 1550.0244 1562.9705 1578.8783 1613.7956 1622.3804 1702.8728 2972.7230 3053.7904 3084.6524 3128.2402 3132.2127 3138.4553 3151.7535 3167.1863 3167.4193 3172.5816 3177.4376
redmass: 1.3011 2.4921 3.8633 4.9965 4.9276 7.6679 6.1802 6.7378 4.9695 4.5663 5.3127 4.9096 3.5063 2.8778 3.5310 9.7350 3.0430 7.7968 3.3086 7.7923 8.3465 6.0377 7.0147 4.7251 4.9720 7.3150 3.0077 3.8063 5.1329 1.4208 7.3146 1.5251 9.1663 1.2483 1.4873 9.4534 1.3768 1.3439 1.5601 1.3764 4.4069 1.3403 2.6509 2.2116 1.5899 2.1651 1.3021 1.1466 1.3713 1.7264 3.2669 2.9016 2.0041 1.3054 2.4043 4.9315 9.9841 1.2212 3.6043 2.5728 2.6966 1.1108 1.0580 2.9889 7.9983 6.8445 6.7979 6.6223 6.4631 12.8801 1.0394 1.0939 1.0999 1.0897 1.0899 1.0865 1.0904 1.0944 1.0960 1.0955 1.0994
irintensity: 0.9393 1.6349 0.1413 0.7054 0.8069 0.8157 0.0176 0.0450 0.1330 1.4338 2.1916 3.5828 0.6374 0.0343 0.0465 1.9346 6.0125 1.7815 21.6343 1.6118 7.5956 2.9180 1.3704 28.4896 0.6954 14.4140 6.8213 25.0947 0.4529 63.1309 45.3422 42.9984 40.4338 0.0410 1.0019 110.7090 2.6027 4.7329 6.7011 0.4138 36.9163 0.0372 14.5767 8.5239 27.3784 15.0683 10.6228 3.7075 93.7427 0.2331 8.3059 50.1721 8.4422 5.7849 14.0435 9.0965 57.7383 11.8206 12.3064 1.0383 122.0364 20.5209 13.5896 139.2434 404.6780 25.4814 66.7743 35.9056 51.5329 393.5160 31.4613 22.5591 16.2551 17.4002 22.4376 4.6618 5.7383 5.4623 13.5433 3.3554 16.8101
temp: 298.150 k
press: 1.00000 atm
elementType: 8 8 7 6 6 6 6 6 6 6 6 6 6 6 6 6 6 6 1 1 1 1 1 1 1 1 1 1 1
symmnumber: 1
zpe: 574222.6 jmol-1
zpe.correction: 0.218710 hartree
zpe.thermalcorrener: 0.233221 hartree
zpe.thermalcorrenthalpy: 0.234165 hartree
zpe.thermalcorrgfe: 0.175982 hartree
zpe.sumelectzpe: -782.186685 hartree
zpe.sumelectthermal: -782.172174 hartree
zpe.sumelectthermalent: -782.171229 hartree
zpe.sumelectthermalfe: -782.229413 hartree
dipole: 0.8525 -3.2693 0.0704
dipole: 3.3794
quadrupole: -70.7486 -106.4582 -107.9185
quadrupole: 8.2674 0.3966 -0.0426
quadrupole: 24.2932 -11.4164 -12.8767 8.2674 0.3966 -0.0426
hfenergy: -782.4053948 hartree
pointgroup: C01 [X(C15H11N1O2)]
dipole: -0.3238416 -1.2892084 -0.027371 debye
polarizability: 345.1068219|-8.9110694|184.1869413|0.4853195|0.0435379|70.655785 unknown
InChI: InChI=1S/C15H11NO2/c1-10-6-8-11(9-7-10)14-16-13-5-3-2-4-12(13)15(17)18-14/h2-9H,1H3
charge 0 multiplicity 1
29 atoms
O  0.269643 1.412653 0.001397
O  2.023424 2.915996 -0.003659
N  0.588772 -0.978539 0.002638
C  -1.666402 -0.013691 0.005838
C  2.565024 0.530304 -0.002832
C  1.980046 -0.780309 -0.000441
C  -0.197586 0.078949 0.003358
C  -4.513297 -0.240765 0.013216
C  -2.285108 -1.293211 0.00768
C  -2.479126 1.151925 0.01009
C  -3.688186 -1.399065 0.012892
C  -3.882323 1.032356 0.015585
C  1.699625 1.719767 -0.002004
C  3.976817 0.684539 -0.006006
C  2.8329 -1.917455 -0.001208
C  4.806108 -0.450056 -0.006778
C  4.228664 -1.751613 -0.004337
C  -6.024765 -0.361034 -0.01292
H  -1.648873 -2.18337 0.008647
H  -2.00214 2.136292 0.012842
H  -4.154671 -2.391384 0.017152
H  -4.500369 1.938018 0.022091
H  4.393793 1.696932 -0.007818
H  2.369319 -2.907924 0.00073
H  5.895031 -0.33656 -0.009217
H  4.881025 -2.631847 -0.004886
H  -6.40107 -0.390502 -1.054826
H  -6.368837 -1.285629 0.483635
H  -6.511139 0.496823 0.484341
