program: Gaussian 09
title: 000292603
version: EM64L-G09RevD.01
frameworkgroup: C1[X(C8H8N2)]
method: RPBEPBE
basis: SDD
operation: Freq
keyword: #p
keyword: freq=noraman
keyword: PBEPBE/SDD
title: #p freq=noraman PBEPBE/SDD
converged: YES YES NO NO
title: Mulliken charges:
elementType: N N C C C C C C C C H H H H H H H H
charge: -0.407543 -0.043455 0.287877 0.256094 -0.345633 -0.343647 -0.215030 -0.258485 -0.636325 -0.282280 0.242450 0.334392 0.251217 0.226686 0.234742 0.234013 0.230925 0.234003
chargesum: 0.00000
title: Mulliken charges with hydrogens summed into heavy atoms:
elementType: N N C C C C C C C C
charge: -0.073151 -0.043455 0.287877 0.256094 -0.103183 -0.092430 0.011656 -0.023744 0.062616 -0.282280
polarizability: 1.27643686e+02 9.12671479e+00 1.24883450e+02 -1.48139432e-03 5.93931929e-03 4.45174444e+01
1716.lowfreq: -10.6943 -7.3037 -0.0004 0.0004 0.0006 4.4304 115.0052 120.8250 123.1808
frequency: 114.9930 120.8236 123.1806 179.7095 233.2837 244.0617 392.5807 418.4305 441.9712 462.9759 502.0369 576.1039 580.1965 593.7035 727.8158 741.9068 757.6653 814.7172 852.1561 947.0187 979.5589 1034.4421 1063.5967 1100.8854 1123.8297 1164.4883 1183.5175 1187.5976 1274.4049 1337.8661 1368.0599 1436.6764 1447.6748 1468.0829 1471.5995 1498.5553 1524.4517 1581.5935 1621.0775 2150.8399 2954.4186 3021.2122 3102.9280 3133.7598 3148.2709 3163.5339 3176.1358 3551.1873
redmass: 2.9757 3.7605 7.3055 1.2266 3.2811 3.2277 4.0108 5.7844 6.7583 1.1841 3.1658 4.5068 6.3231 5.7401 4.7510 3.6242 1.2996 5.2107 1.4846 1.3718 1.3253 2.3356 3.7788 1.6722 1.2801 1.5248 1.3093 2.0354 1.6217 1.8368 5.4786 1.6719 1.7613 1.6254 1.0407 1.1411 2.5603 4.0152 6.4859 12.6139 1.0377 1.1013 1.0963 1.0864 1.0898 1.0938 1.1003 1.0776
irintensity: 4.1860 0.4946 5.7889 1.2318 0.5842 0.0882 1.7085 3.3990 0.5342 123.3497 0.5435 2.8883 1.1706 1.2511 2.4415 0.0002 104.3648 3.5925 0.5965 3.0152 0.1575 9.2690 3.6164 3.3169 1.5265 1.1267 8.2910 15.0956 7.1479 25.1632 51.7251 18.3092 13.8191 12.8334 14.2501 2.6844 166.1333 81.2542 147.8101 84.9283 84.8728 45.9746 18.7577 5.4050 4.7166 21.1161 14.1265 41.0531
temp: 298.150 k
press: 1.00000 atm
elementType: 7 7 6 6 6 6 6 6 6 6 1 1 1 1 1 1 1 1
symmnumber: 1
zpe: 371414.0 jmol-1
zpe.correction: 0.141464 hartree
zpe.thermalcorrener: 0.150599 hartree
zpe.thermalcorrenthalpy: 0.151543 hartree
zpe.thermalcorrgfe: 0.107368 hartree
zpe.sumelectzpe: -418.434165 hartree
zpe.sumelectthermal: -418.425030 hartree
zpe.sumelectthermalent: -418.424086 hartree
zpe.sumelectthermalfe: -418.468261 hartree
dipole: 0.2317 -4.3728 0.0035
dipole: 4.3790
quadrupole: -47.8068 -65.8113 -62.7159
quadrupole: -7.5054 0.0054 0.0098
quadrupole: 10.9712 -7.0333 -3.9379 -7.5054 0.0054 0.0098
hfenergy: -418.575629 hartree
pointgroup: C01 [X(C8H8N2)]
dipole: -1.1450502 -1.2851685 0.0729368 debye
dipolederiv: -0.5887249 0.8030831 -0.0284485 0.359969 -1.1041934 0.0183405 -0.0106589 0.0084454 -0.4673136 -0.5913135 -0.2126233 0.0143725 -0.051418 -0.2877855 0.0019158 0.0083819 0.0051765 -0.2630067 0.5910136 -1.046411 0.0319788 -0.4240425 0.8268471 -0.0187507 0.0080071 -0.0067743 0.1378687 -0.4162527 -0.2907055 0.0196463 0.3143514 -0.2040829 0.0031409 -0.0039176 0.0145281 0.0280284 -0.2851764 0.610094 -0.0227321 -0.0222611 -0.0761119 -0.0060528 0.0016752 -0.0176917 -0.2392043 0.4490379 0.2017115 -0.0182688 -0.2334423 0.0558772 -0.0018917 -0.0015675 -0.0102537 -0.1103888 0.1362309 -0.1303344 0.0003923 0.1533227 0.4641229 -0.0250219 -0.0105533 -0.0196994 -0.1126403 -0.3168263 -0.2570353 0.0116601 -0.2320492 -0.3296092 0.008604 0.0106839 0.0090056 -0.2222456 0.1458086 0.1751069 -0.0044543 -0.025178 0.7089089 -0.0167964 0.0031173 -0.0199921 0.2840138 0.6735303 0.41002 -0.0283585 0.1356874 -0.0146311 -0.0012431 -0.017706 -0.0066014 0.0204965 0.0766488 -0.0311437 0.0030182 -0.0544758 -0.0924052 0.0112996 0.0038124 0.0109195 0.171959 0.1832805 -0.0583781 0.0048674 -0.0092429 0.1042212 0.0086976 0.0026002 0.0096887 0.3266972 0.08405 -0.0593924 0.0037032 -0.0354182 -0.0552503 0.0088916 0.0027822 0.009401 0.1594036 -0.1124528 -0.0468166 0.0067344 -0.0572237 0.0818746 0.003741 0.0072189 0.0035138 0.151238 -0.0235575 0.0912423 0.0003299 0.1007316 -0.015225 0.0055198 -0.0000886 0.0056655 0.1789462 0.0426456 -0.1469111 0.1195461 0.015039 -0.0333664 0.0199195 0.0762802 0.1065342 -0.0956439 -0.082305 0.1485274 -0.0011405 0.057849 0.0129017 0.0033307 0.0023177 0.001577 0.1289683 0.0343629 -0.1600339 -0.1128465 0.0078016 -0.0420927 -0.0236445 -0.082385 -0.1034428 -0.0771765 unknown
polarizability: 135.3714501|-1.3492943|117.016563|-1.6776239|-2.7747783|44.6565668 unknown
InChI: InChI=1S/C8H8N2/c1-10-8-5-3-2-4-7(8)6-9/h2-5,10H,1H3
charge 0 multiplicity 1
18 atoms
N  0.951861 -1.620278 0.074701
N  2.900998 1.331684 -0.07766
C  -0.03085 -0.645038 0.055583
C  0.335118 0.750489 -0.004815
C  -1.420497 -0.969309 0.094099
C  -0.665338 1.75803 -0.024287
C  -2.393798 0.046685 0.073258
C  -2.029625 1.415927 0.014286
C  0.674777 -3.054472 0.135955
C  1.72553 1.095794 -0.045225
H  -1.732742 -2.016467 0.140486
H  1.925614 -1.314816 0.045351
H  -0.353545 2.806603 -0.0703
H  -3.45339 -0.231838 0.103793
H  -2.796351 2.195824 -0.001086
H  0.122204 -3.329002 1.056729
H  1.629476 -3.604349 0.136681
H  0.083955 -3.398066 -0.736546
