program: Gaussian 09
title: 000292604
version: EM64L-G09RevD.01
frameworkgroup: C1[X(C10H7Br2N)]
method: RPBEPBE
basis: SDD
operation: Freq
keyword: #p
keyword: freq=noraman
keyword: PBEPBE/SDD
title: #p freq=noraman PBEPBE/SDD
converged: NO YES NO NO
title: Mulliken charges:
elementType: Br Br N C C C C C C C C C C H H H H H H H
charge: 0.069942 0.069995 0.055194 0.427739 -0.075699 0.315696 -0.290687 -0.328320 -0.385920 -0.309086 -0.241819 -0.217142 -0.903179 0.248878 0.236024 0.237907 0.271854 0.234435 0.237367 0.346822
chargesum: 0.00000
title: Mulliken charges with hydrogens summed into heavy atoms:
elementType: Br Br N C C C C C C C C C C
charge: 0.069942 0.069995 0.055194 0.427739 -0.075699 0.315696 -0.041809 -0.092296 -0.148013 -0.037232 -0.007384 0.020225 -0.556357
polarizability: 2.20190131e+02 1.30225414e-02 1.04939413e+02 -9.88075953e+00 -5.57512587e-02 1.36429818e+02
1716.lowfreq: -7.4722 -6.5823 -1.1962 -0.0004 -0.0003 0.0002 19.1147 47.4764 97.5177
frequency: 18.1428 47.4747 97.5176 139.1016 143.4963 172.9768 229.4239 301.8790 392.1630 399.8891 478.2950 488.3305 510.4658 515.3466 595.8572 602.4802 644.4239 702.9747 730.5403 756.7631 771.2647 805.2497 841.0299 889.5233 898.4217 949.7208 966.1869 981.7439 1001.4513 1015.2296 1113.9461 1149.9100 1150.7450 1158.8063 1168.9813 1230.9348 1245.2882 1280.2800 1306.4615 1364.1237 1404.1434 1419.3777 1458.7941 1498.2029 1549.1293 1584.4526 1623.9569 3124.1193 3124.9640 3132.2061 3140.9562 3157.4889 3158.7798 3174.9486
redmass: 6.2069 11.1515 9.6749 6.6470 17.5299 4.1953 11.3516 6.3130 4.7498 3.3680 2.9381 7.0441 4.3935 7.2539 5.2322 7.1531 5.9273 2.5329 6.0808 5.7658 1.4373 2.9763 1.5826 1.6949 6.3232 4.8243 1.3543 1.3995 1.3389 2.1753 1.7808 1.3945 1.0627 1.2714 1.1124 1.8316 1.9765 2.2085 2.6619 3.3924 4.2011 2.3015 3.1425 3.4747 7.3674 6.3622 6.4822 1.0887 1.0874 1.0884 1.0899 1.0979 1.0956 1.0990
irintensity: 0.0866 0.4241 0.8177 0.0015 0.3671 2.8968 1.4030 2.1411 5.5028 1.0582 10.7030 17.5090 44.0001 0.4917 91.1010 6.2616 9.8736 16.6232 28.0956 12.5338 93.7793 3.3642 44.4109 1.3839 10.2627 5.5395 0.4812 4.2426 0.0818 6.9932 9.3869 6.3657 32.8028 4.6456 2.7068 6.5060 0.1054 8.5084 15.7811 1.7946 6.6320 6.3361 3.0429 19.5884 13.1901 14.0968 3.3374 0.7840 3.0321 4.1508 11.9274 16.6394 22.2266 15.4995
temp: 298.150 k
press: 1.00000 atm
elementType: 35 35 7 6 6 6 6 6 6 6 6 6 6 1 1 1 1 1 1 1
symmnumber: 1
zpe: 369696.1 jmol-1
zpe.correction: 0.140810 hartree
zpe.thermalcorrener: 0.152011 hartree
zpe.thermalcorrenthalpy: 0.152955 hartree
zpe.thermalcorrgfe: 0.099971 hartree
zpe.sumelectzpe: -466.032985 hartree
zpe.sumelectthermal: -466.021784 hartree
zpe.sumelectthermalent: -466.020840 hartree
zpe.sumelectthermalfe: -466.073823 hartree
dipole: 4.0852 -0.0031 2.8552
dipole: 4.9841
quadrupole: -80.0868 -99.2049 -82.2466
quadrupole: 0.0001 -2.0485 -0.0206
quadrupole: 7.0926 -12.0255 4.9328 0.0001 -2.0485 -0.0206
hfenergy: -466.1737946 hartree
pointgroup: C01 [X(C10H7Br2N1)]
dipole: -1.4570442 -1.3122918 -0.0000393 debye
dipolederiv: -0.3400765 -0.0692637 -0.1943649 -0.246266 -0.1134575 -0.2469136 -0.2969211 -0.1393624 -0.6489781 -0.3398679 -0.0693212 0.1943498 -0.2462907 -0.1135076 0.2470322 0.2967204 0.1394647 -0.648697 -0.2775221 0.0741574 -0.0000155 0.0960519 -0.2972282 0.0000253 -0.0000405 0.000006 -0.1958366 0.0234176 -0.1330673 0.0000259 0.2106656 -0.2183928 0.0000995 -0.00005 0.0000818 0.0807834 0.1103097 -0.0794719 -0.0000153 -0.3852928 0.0924854 -0.000033 0.0001005 -0.0000066 0.0830759 0.198315 0.094985 -0.0000003 0.0914751 0.1399117 0.0000196 0.0002188 0.0000014 -0.1265255 0.2052538 0.0953447 -0.0000151 -0.0704074 0.1781231 -0.0000627 -0.0000067 -0.0000869 -0.1039614 -0.4066131 -0.1869338 0.000043 -0.1262842 -0.0298162 -0.0000481 0.0000362 -0.000038 -0.1273164 -0.0284673 0.0856707 -0.0000161 0.1422799 0.0821681 -0.0000555 -0.0000401 -0.0000681 -0.1732663 -0.0814231 0.1034091 -0.0000161 0.0218576 0.072549 -0.0000647 0.0000056 -0.0000537 -0.1457247 0.1129251 0.0738386 -0.0000218 0.1062366 -0.0307254 -0.0000219 -0.0000233 -0.0000269 -0.1410668 -0.0766907 -0.1242026 0.0000211 -0.1517533 0.1114595 -0.0000788 0.0000404 -0.0000689 -0.1451235 0.8595535 0.2169466 0.0000371 0.5081157 0.2838037 -0.0001521 -0.0000105 -0.0001427 1.4693675 0.0360385 -0.0975352 0.0000206 -0.0413396 -0.0549775 0.0000479 0.0000153 0.0000527 0.1447593 0.0052729 0.112844 -0.0000281 0.096645 0.0048302 0.0000376 -0.0000204 0.0000519 0.1473942 0.0372374 -0.029357 0.0000035 -0.1082661 -0.0807507 0.0000558 0.0000263 0.0000634 0.1583575 0.0800246 -0.073633 0.0000208 -0.0172466 -0.0120206 0.0000423 0.0000028 0.0000465 0.1544387 -0.1285203 -0.0235891 -0.0000002 -0.0199386 0.0905977 0.000017 0.0000006 0.0000178 0.159974 -0.0000057 0.0983416 -0.0000284 0.1076667 -0.0371885 0.0000533 -0.0000319 0.000052 0.1585373 0.0108387 -0.0691627 0.0000002 0.0320915 -0.0678633 0. -0.0000225 0.000016 -0.1001915 unknown
polarizability: 221.3352964|0.6314998|135.2847344|0.0127962|-0.0220093|104.9393313 unknown
InChI: InChI=1S/C10H7Br2N/c11-10(12)9-6-5-7-3-1-2-4-8(7)13-9/h1-6,10H
charge 0 multiplicity 1
20 atoms
Br 3.573204 0.826162 1.662248
Br 3.573328 0.826696 -1.661563
N  0.657122 0.704582 -0.000158
C  -1.2867 -0.843818 0.000207
C  -0.709321 0.488658 -0.000118
C  1.471299 -0.366655 0.000108
C  -0.38292 -1.953686 0.000498
C  0.993871 -1.722639 0.000457
C  -2.711628 -0.989596 0.000222
C  -1.577759 1.628497 -0.000424
C  -3.533793 0.139232 -0.000076
C  -2.963029 1.454895 -0.000401
C  2.96375 -0.144816 0.000131
H  -0.777546 -2.976132 0.000752
H  1.704859 -2.55506 0.000687
H  -3.145523 -1.996726 0.000472
H  -1.113691 2.619189 -0.00067
H  -4.623454 0.026708 -0.000064
H  -3.625716 2.327068 -0.000631
H  3.528346 -1.086059 0.000023
