program: Gaussian 09
title: 000292577
version: EM64L-G09RevD.01
frameworkgroup: C1[X(C7H4FNO2S2)]
method: RPBEPBE
basis: SDD
operation: Freq
keyword: #p
keyword: freq=noraman
keyword: PBEPBE/SDD
title: #p freq=noraman PBEPBE/SDD
converged: YES YES NO YES
title: Mulliken charges:
elementType: S S F O O N C C C C C C C H H H H
charge: 1.097316 0.191603 -0.342141 -0.474115 -0.474148 0.307101 -0.125201 -0.177955 -0.177811 -0.353138 -0.353139 0.506713 -0.761456 0.293503 0.293477 0.274695 0.274697
chargesum: 0.00000
title: Mulliken charges with hydrogens summed into heavy atoms:
elementType: S S F O O N C C C C C C C
charge: 1.097316 0.191603 -0.342141 -0.474115 -0.474148 0.307101 -0.125201 0.115548 0.115666 -0.078443 -0.078442 0.506713 -0.761456
polarizability: 3.01714146e+02 -5.81275806e-03 1.07467875e+02 -5.84266594e+00 8.26412668e-03 6.12501451e+01
1716.lowfreq: -14.2379 -8.4677 -4.5567 -0.0032 -0.0021 -0.0011 16.9557 31.1222 38.0310
frequency: 16.5925 30.7329 38.0253 99.1500 132.0560 175.8527 205.6232 227.7557 290.2763 330.6767 357.0887 373.7574 388.2002 406.7902 436.2549 443.7569 478.1574 515.2584 557.6573 618.2906 689.3260 713.9207 828.6723 845.9354 853.9724 902.8437 967.4591 978.5959 984.9948 996.2757 1045.6946 1112.7619 1179.9651 1286.1067 1291.1975 1363.0287 1410.8505 1468.1838 1570.9221 1588.9464 2187.5182 3161.6955 3161.9690 3179.9174 3183.0407
redmass: 11.8771 5.5686 12.7410 13.2637 9.8976 11.3795 14.6968 13.2967 12.2957 12.6979 9.0846 13.1860 8.9806 2.9286 10.1053 6.5137 11.6885 3.6562 11.7721 7.2434 7.7410 3.4974 1.2412 1.5804 17.3263 7.7175 1.3398 1.3749 5.1821 15.8919 2.4505 1.3277 1.1175 4.1488 1.2612 5.7401 3.8599 2.4972 7.7891 6.1123 12.8953 1.0896 1.0900 1.0971 1.0983
irintensity: 1.0974 0.0051 2.6696 1.4602 4.6777 4.7033 0.2474 4.4810 4.8570 0.4493 2.1863 77.1589 0.9085 0.0123 1.7339 2.6434 26.6800 30.8777 188.2742 0.0119 69.2379 0.3648 0.2303 88.6846 136.8205 44.3157 0.8942 1.7200 6.3318 77.4298 49.8751 5.8336 16.8088 12.5074 3.1551 0.0884 15.0701 33.2934 3.4600 186.2331 1801.9420 3.2027 1.2106 0.0739 6.6671
temp: 298.150 k
press: 1.00000 atm
elementType: 16 16 9 8 8 7 6 6 6 6 6 6 6 1 1 1 1
symmnumber: 1
zpe: 257650.2 jmol-1
zpe.correction: 0.098134 hartree
zpe.thermalcorrener: 0.110915 hartree
zpe.thermalcorrenthalpy: 0.111859 hartree
zpe.thermalcorrgfe: 0.055673 hartree
zpe.sumelectzpe: -1369.209998 hartree
zpe.sumelectthermal: -1369.197217 hartree
zpe.sumelectthermalent: -1369.196273 hartree
zpe.sumelectthermalfe: -1369.252460 hartree
dipole: -4.5702 0.0004 -0.6293
dipole: 4.6133
quadrupole: -121.0314 -83.3079 -94.1730
quadrupole: -0.0008 -0.9750 -0.0006
quadrupole: -21.5273 16.1962 5.3311 -0.0008 -0.9750 -0.0006
hfenergy: -1369.3081322 hartree
pointgroup: C01 [X(C7H4F1N1O2S2)]
dipole: -1.7993966 0.0002788 -0.2375948 debye
dipolederiv: 2.6051271 0.0001204 0.0076213 -0.0001628 1.1974962 -0.0006526 0.1399148 -0.0006218 1.6187342 -1.4447277 -0.0000796 0.0355624 0.0004286 -0.0200028 -0.0000093 0.0371506 0.0000034 -0.0221257 -0.6658477 0.0000863 -0.0554934 0.0009074 -0.320925 0.0011152 -0.4429898 0.0009959 -0.8839096 -0.7546137 0.0245105 0.0198186 0.1652985 -0.5349292 -0.0753599 0.0642183 -0.036249 -0.430895 -0.7544832 -0.0246446 0.0197443 -0.1655719 -0.5354396 0.0748967 0.0637072 0.0358438 -0.4304597 -3.2660943 -0.0000899 0.08093 -0.0004386 -0.1406297 -0.000095 0.0804787 -0.0001052 -0.0322274 -0.6091542 -0.000042 0.0117768 -0.0004609 -0.1081233 0.0000029 0.2975677 -0.000019 -0.1682478 0.1649186 0.1112214 -0.0099278 -0.336395 -0.0003329 0.0114756 -0.0738325 -0.0118594 -0.0614921 0.1648498 -0.1111956 -0.010181 0.3364182 -0.0002245 -0.011378 -0.0730166 0.0120607 -0.0614512 -0.5601982 -0.123974 0.0080158 -0.2876354 0.0059033 0.0057496 0.0004952 0.0049989 -0.140211 -0.5602894 0.1239009 0.0082566 0.2874847 0.0060116 -0.0054668 0.0010703 -0.0047259 -0.1402058 2.1199655 0.000167 -0.0502504 0.0003146 0.263187 0.000129 -0.0535229 0.0001305 0.1269178 3.3192956 0.0000521 -0.0852438 -0.0001832 -0.033458 0.0000205 -0.0892264 0.0000151 -0.0481352 0.09996 -0.0553254 0.0052313 -0.0189304 0.0868186 0.0001735 0.0056078 0.0092686 0.1615971 0.0998757 0.0553115 0.0053432 0.0189653 0.0868424 -0.0003093 0.0056246 -0.0094449 0.1615465 0.0206903 0.0576662 0.0044533 0.0526193 0.0239153 -0.0003054 0.0184303 -0.0008125 0.1752857 0.0207258 -0.0576852 0.0043427 -0.0526587 0.0238906 0.0000132 0.0183227 0.0005206 0.175279 unknown
polarizability: 301.6417119|0.0133753|107.4678213|-7.179772|0.0506138|61.3226332 unknown
InChI: InChI=1S/C7H4FNO2S2/c8-13(10,11)7-3-1-6(2-4-7)9-5-12/h1-4H
charge 0 multiplicity 1
17 atoms
S  3.053929 0.000605 -0.062969
S  -5.784969 -0.000233 0.177489
F  3.357094 -0.003055 1.771875
O  3.604157 -1.408471 -0.602293
O  3.603833 1.411899 -0.596815
N  -2.953603 -0.000436 0.104163
C  1.19251 0.000301 -0.004324
C  0.532344 1.241665 0.016432
C  0.532714 -1.241302 0.013945
C  -0.873206 1.237685 0.049098
C  -0.872832 -1.237799 0.046674
C  -1.581593 -0.000178 0.068503
C  -4.162743 -0.000647 0.135182
H  1.095729 2.179512 -0.00407
H  1.096361 -2.178946 -0.00846
H  -1.43099 2.177971 0.063102
H  -1.430334 -2.17827 0.058866
