program: Gaussian 09
title: 000292624
version: EM64L-G09RevD.01
frameworkgroup: C1[X(C15H15Cl2NO2)]
method: RPBEPBE
basis: SDD
operation: Freq
keyword: #p
keyword: freq=noraman
keyword: PBEPBE/SDD
title: #p freq=noraman PBEPBE/SDD
converged: YES YES NO NO
title: Mulliken charges:
elementType: Cl Cl O O N C C C C C C C C C C C C C C C H H H H H H H H H H H H H H H
charge: -0.039230 -0.031789 -0.307395 -0.305799 -0.438820 0.330922 -0.486867 -0.007084 -0.395372 0.220694 0.590583 -0.217630 -0.361415 -0.314979 -0.368829 -0.054014 -0.214421 -0.275234 -0.529384 -0.527789 0.270814 0.225852 0.320844 0.263513 0.232469 0.255197 0.253112 0.228363 0.257112 0.259109 0.226229 0.231809 0.253733 0.223971 0.231726
chargesum: 0.00000
title: Mulliken charges with hydrogens summed into heavy atoms:
elementType: Cl Cl O O N C C C C C C C C C C C C C C C
charge: -0.039230 -0.031789 -0.307395 -0.305799 -0.117977 0.330922 0.009799 -0.007084 -0.131860 0.220694 0.590583 0.014838 -0.106218 -0.314979 -0.115717 -0.054014 0.013942 -0.018122 0.187763 0.181642
polarizability: 2.81189687e+02 -7.43280876e+00 1.96263140e+02 -5.88917928e+00 4.71826196e+00 1.23076521e+02
1716.lowfreq: -7.0332 0.0023 0.0024 0.0029 2.2925 2.3253 7.8086 21.9551 39.7788
frequency: 6.6146 21.9209 39.7768 60.7252 82.2046 92.3916 108.9699 119.6714 147.3518 157.7777 159.4300 170.7269 193.7685 200.4342 206.3028 239.6820 265.2492 278.5371 312.7195 351.0279 356.3590 394.6092 426.4190 443.5798 452.5987 490.1144 503.7255 520.3147 539.8669 558.7386 561.6008 602.3815 612.3747 692.7955 706.5991 711.8066 755.7709 759.6567 781.1828 800.9532 842.4727 880.3485 889.4849 909.9241 944.7806 951.7789 970.0269 976.9533 1001.7492 1011.4392 1068.5722 1089.3468 1109.5270 1113.1757 1115.7169 1145.3738 1153.1696 1159.5865 1166.7981 1173.4324 1198.7088 1217.2976 1237.0149 1265.3273 1305.2181 1346.5820 1359.4892 1371.6133 1418.2878 1418.8319 1430.4122 1445.3775 1448.8131 1457.2165 1461.0790 1462.4879 1477.6681 1487.3004 1495.9179 1506.6009 1557.0096 1590.9942 1595.4160 1614.8431 2938.3992 2974.2660 2977.0094 3007.4920 3071.8517 3076.1079 3123.3878 3124.7517 3131.7871 3143.5382 3150.4113 3170.4022 3170.9543 3185.3503 3545.5379
redmass: 5.2582 6.6189 5.8968 6.6191 4.0976 3.5223 2.8648 4.9020 1.3255 1.9281 1.5435 2.9884 14.4625 4.5915 4.3173 3.7833 5.3448 4.9038 5.3875 5.2690 6.7209 5.3735 8.2906 2.1470 1.6490 4.4600 4.8856 5.6122 5.2703 4.5827 3.7105 4.6424 6.2747 2.6661 6.7815 6.1205 2.4109 1.6035 5.2227 1.8668 1.4357 5.0076 4.8169 1.4303 9.2992 1.3172 1.8977 1.7561 5.9056 2.7007 1.9801 1.8994 3.4501 1.2784 1.2627 1.5356 1.3547 1.5372 2.1058 1.3377 1.4212 1.2345 1.9671 2.5747 1.6205 1.9794 4.4179 2.9450 1.3612 2.9677 1.3228 2.1274 2.0568 1.0778 1.1433 2.1318 1.0667 1.0527 1.2320 2.3381 4.9102 7.0884 6.6901 7.1642 1.0655 1.0309 1.0308 1.0941 1.1036 1.1041 1.1028 1.1033 1.0873 1.0873 1.0919 1.0986 1.0928 1.0971 1.0769
irintensity: 0.3275 0.0372 0.0336 0.3986 2.7138 5.6995 6.8066 2.8613 0.1048 2.3304 1.1030 3.0135 0.3040 0.0626 5.3643 3.4788 0.9376 9.9744 7.3707 0.1764 4.2604 19.1096 6.9735 36.4137 58.3921 0.3275 2.8808 17.4513 1.6402 1.7566 1.4920 0.6953 13.0448 8.7331 14.7661 3.9127 33.3477 69.4730 19.0302 35.7045 1.5908 39.0451 6.6276 9.1318 55.2466 0.6503 26.2737 38.9094 59.5601 63.9380 34.5389 2.6791 20.6900 11.7755 6.1814 7.6073 0.1261 4.8671 22.2103 5.8422 7.9972 19.2765 58.7174 70.0098 28.2943 13.2177 56.6457 21.3623 17.9015 7.1522 8.9306 93.1471 45.1178 22.1147 5.4512 11.6803 5.1634 17.8254 160.2177 119.1139 25.8442 15.0533 3.1814 386.9934 30.3676 84.7275 48.0825 11.4825 27.4469 24.9226 23.0684 17.7913 5.8140 12.7415 10.8953 11.7054 10.9449 3.9560 51.0232
temp: 298.150 k
press: 1.00000 atm
elementType: 17 17 8 8 7 6 6 6 6 6 6 6 6 6 6 6 6 6 6 6 1 1 1 1 1 1 1 1 1 1 1 1 1 1 1
symmnumber: 1
zpe: 696951.2 jmol-1
zpe.correction: 0.265455 hartree
zpe.thermalcorrener: 0.285670 hartree
zpe.thermalcorrenthalpy: 0.286614 hartree
zpe.thermalcorrgfe: 0.213370 hartree
zpe.sumelectzpe: -1704.416558 hartree
zpe.sumelectthermal: -1704.396343 hartree
zpe.sumelectthermalent: -1704.395398 hartree
zpe.sumelectthermalfe: -1704.468642 hartree
dipole: -4.3240 -2.0989 -0.8850
dipole: 4.8873
quadrupole: -132.5644 -123.2292 -129.5099
quadrupole: -2.5906 -3.0538 -2.5635
quadrupole: -4.1299 5.2053 -1.0754 -2.5906 -3.0538 -2.5635
hfenergy: -1704.6820124 hartree
pointgroup: C01 [X(C15H15Cl2N1O2)]
dipole: -1.5845516 0.3029251 1.0462785 debye
polarizability: 280.6565032|-14.2567693|139.6248386|3.0180616|29.8482153|180.2480067 unknown
InChI: InChI=1S/C15H15Cl2NO2/c1-19-13-8-3-5-10(15(13)20-2)9-18-12-7-4-6-11(16)14(12)17/h3-8,18H,9H2,1-2H3
charge 0 multiplicity 1
35 atoms
Cl 2.843874 -0.595418 -2.51856
Cl 6.001426 -0.560003 -1.668239
O  -2.367126 1.477553 1.082021
O  -4.90852 0.932398 -0.204417
N  0.97927 -0.389736 -0.159149
C  -1.463277 -0.568692 0.104092
C  -0.13415 -0.308905 0.797895
C  -2.546639 0.334139 0.265357
C  -1.643752 -1.719587 -0.706118
C  -3.804678 0.06049 -0.349086
C  2.311436 -0.36286 0.215912
C  -2.871587 -1.958542 -1.35993
C  -3.955452 -1.071215 -1.17583
C  3.347149 -0.455054 -0.769612
C  2.718541 -0.252435 1.581902
C  4.702678 -0.441513 -0.404322
C  4.0827 -0.245708 1.929493
C  5.094055 -0.339199 0.948231
C  -2.487979 2.772021 0.364498
C  -5.434662 1.050901 1.176785
H  -0.169069 0.678405 1.297395
H  0.015704 -1.070098 1.594041
H  0.758913 -0.40714 -1.156099
H  -0.811455 -2.422944 -0.822981
H  -2.993363 -2.84284 -1.993998
H  -4.927585 -1.242332 -1.648861
H  1.959426 -0.164073 2.363151
H  4.367809 -0.161624 2.983532
H  6.154061 -0.331038 1.21224
H  -3.472327 2.854808 -0.129397
H  -1.679876 2.866213 -0.384896
H  -2.374885 3.545205 1.139349
H  -4.651338 1.403395 1.871473
H  -5.827343 0.073857 1.516351
H  -6.254381 1.782374 1.113075
