program: Gaussian 09
title: 000292681
version: EM64L-G09RevD.01
frameworkgroup: C1[X(C22H16FNO4S)]
method: RPBEPBE
basis: SDD
operation: Freq
keyword: #p
keyword: freq=noraman
keyword: PBEPBE/SDD
title: #p freq=noraman PBEPBE/SDD
converged: YES YES NO NO
title: Mulliken charges:
elementType: S F O O O O N C C C C C C C C C C C C C C C C C C C C C C H H H H H H H H H H H H H H H H
charge: 1.082722 -0.346857 -0.296250 -0.247995 -0.482754 -0.470696 -0.489631 0.269967 0.196834 0.296383 0.341969 0.137901 -0.437061 -0.331624 -0.170566 -0.377214 -0.189361 -0.383785 -0.372866 0.328452 -0.391784 -0.367173 0.332023 0.438275 -0.378209 -0.356704 -0.346083 -0.374122 -0.802760 0.330947 0.265770 0.328035 0.249980 0.290212 0.234339 0.256182 0.264482 0.276028 0.257841 0.264668 0.237241 0.237751 0.228121 0.239773 0.227600
chargesum: 0.00000
title: Mulliken charges with hydrogens summed into heavy atoms:
elementType: S F O O O O N C C C C C C C C C C C C C C C C C C C C C C
charge: 1.082722 -0.346857 -0.296250 -0.247995 -0.482754 -0.470696 -0.158684 0.269967 0.196834 0.296383 0.341969 0.137901 -0.171291 -0.003589 -0.170566 -0.127234 0.100851 -0.149447 -0.116684 0.328452 -0.127303 -0.091145 0.332023 0.438275 -0.120368 -0.092036 -0.108842 -0.136371 -0.107265
polarizability: 5.92946157e+02 -4.87583153e+00 2.72832438e+02 -1.79428105e+01 -5.49771872e+00 1.53399167e+02
1716.lowfreq: -12.3629 -6.9077 -5.2153 -0.0005 0.0014 0.0017 2.2988 7.6220 16.9361
frequency: -6.9536 5.6692 16.7199 23.5966 29.5031 33.5981 58.3119 71.4202 73.3191 102.4495 117.3216 132.3565 154.3522 172.8526 185.0498 194.4771 211.3833 231.9727 251.8982 266.8512 295.7544 305.8348 328.1641 342.2628 358.0784 375.5389 379.3826 393.4573 410.6886 415.3595 431.2222 440.2402 481.1809 493.7441 503.3070 513.7464 528.4502 538.8873 559.2841 584.6147 599.6670 618.6252 624.5089 631.8283 647.4115 665.2176 678.1513 699.2135 720.5920 737.7307 758.0765 770.1227 790.4376 824.0632 825.2809 827.9373 833.1300 838.3752 848.5634 856.9539 858.7263 868.5427 916.4686 948.2641 952.0781 955.6110 966.2069 967.8837 975.6249 986.2258 994.3010 1001.1674 1006.9215 1038.6813 1047.6234 1049.5062 1084.2558 1115.3214 1123.2113 1151.4251 1153.1612 1177.6188 1192.3128 1217.9363 1229.5147 1235.5992 1250.1430 1256.2430 1290.9408 1298.2918 1308.0802 1335.4161 1365.9236 1375.5638 1392.3557 1399.8565 1406.1576 1416.3271 1426.4313 1460.7228 1472.3691 1474.4990 1487.1276 1493.5464 1499.1949 1544.1127 1570.3822 1585.5658 1593.7349 1599.0355 1610.5703 1621.7596 1629.6123 2977.9556 3059.2217 3088.0754 3122.3510 3129.7706 3132.2171 3138.3300 3146.8131 3146.8804 3157.9537 3168.7866 3170.3542 3170.8239 3173.4558 3185.1030 3542.6587
redmass: 1.0216 6.7092 10.1850 5.9699 6.0524 5.1802 5.7074 5.9037 5.3781 10.2610 7.4493 5.5609 7.0154 6.3952 4.5378 8.3011 11.1049 8.5204 7.5681 8.0433 7.7725 4.4024 5.8065 5.8414 6.4854 5.9265 6.0326 4.4058 2.9399 3.0190 9.6373 4.0653 3.4630 4.2023 7.2891 4.2857 5.1945 4.9998 7.0841 5.1750 5.0711 1.4381 6.8603 5.9044 5.8291 4.4640 3.4509 4.1041 4.0983 4.0920 5.5184 2.8141 4.5917 1.6433 1.5496 1.5225 2.0092 1.5201 2.0261 5.1688 7.2137 1.7229 6.0142 1.3095 1.3603 1.3540 1.3720 1.3652 1.3452 1.4001 16.8513 2.9130 2.8560 3.2726 1.5501 1.9409 4.1355 1.2672 1.3317 1.3222 2.0870 1.2705 1.4339 2.6933 1.6795 3.0686 3.1558 1.7219 2.2499 1.3128 1.3448 2.5885 4.3240 4.7795 4.0548 1.2242 3.2608 7.6859 4.2296 2.7435 1.0820 1.0667 2.6738 3.4334 3.0435 9.5203 6.2973 4.6030 6.7628 7.8248 6.1767 6.1859 6.2747 1.0388 1.0952 1.0997 1.0895 1.0891 1.0895 1.0901 1.0892 1.0924 1.0960 1.0959 1.0952 1.0962 1.0957 1.0922 1.0771
irintensity: 0.4086 0.2098 0.1466 0.7532 2.0544 3.7711 1.6757 0.6914 0.3067 1.2183 3.4667 2.1320 0.5821 3.6591 0.4978 0.6462 2.4997 2.8828 4.3015 11.0862 4.2348 11.6557 2.8663 3.8075 14.1576 1.9584 3.4545 14.8581 0.5292 1.2700 64.0653 9.9694 24.1072 13.2843 12.4097 41.3738 38.3504 20.0738 144.4435 3.2433 17.7340 30.6760 1.9811 13.4670 14.1854 14.6481 13.8008 0.2968 3.2978 2.0415 4.0768 6.5948 2.7976 7.4743 104.9538 15.0784 13.6162 4.2893 114.7284 101.6695 25.5128 24.4536 12.4747 3.4650 7.8268 2.2644 4.7216 1.2902 0.9651 0.1904 68.2400 12.2678 22.3969 56.6721 23.3880 31.0258 1.9157 13.6954 15.5309 39.2711 6.7662 198.1068 158.8836 77.0475 14.4163 473.2588 10.3206 39.1501 0.6086 1.9358 1.0586 50.1154 14.0860 6.5595 130.8355 12.0857 3.9642 35.9602 0.9867 31.1038 12.1983 11.8433 694.9601 18.6876 38.9088 134.5724 18.6168 4.3691 5.0367 75.0008 317.2050 239.3684 212.7286 39.8627 19.7044 16.3138 17.4166 12.0994 28.4474 3.9235 5.2460 16.1977 7.4714 3.1873 2.5560 5.6934 2.6815 3.7254 50.5035
temp: 298.150 k
press: 1.00000 atm
elementType: 16 9 8 8 8 8 7 6 6 6 6 6 6 6 6 6 6 6 6 6 6 6 6 6 6 6 6 6 6 1 1 1 1 1 1 1 1 1 1 1 1 1 1 1 1
symmnumber: 1
zpe: 853518.1 jmol-1
zpe.correction: 0.325088 hartree
zpe.thermalcorrener: 0.350116 hartree
zpe.thermalcorrenthalpy: 0.351061 hartree
zpe.thermalcorrgfe: 0.265626 hartree
zpe.sumelectzpe: -1699.326266 hartree
zpe.sumelectthermal: -1699.301238 hartree
zpe.sumelectthermalent: -1699.300293 hartree
zpe.sumelectthermalfe: -1699.385728 hartree
dipole: -13.4987 -5.2055 -0.2015
dipole: 14.4690
quadrupole: -220.7184 -176.4309 -179.1765
quadrupole: -29.2035 -9.1164 -0.0260
quadrupole: -28.6098 15.6777 12.9321 -29.2035 -9.1164 -0.0260
hfenergy: -1699.6513541 hartree
pointgroup: C01 [X(C22H16F1N1O4S1)]
dipole: -5.2442993 -0.824099 -2.0551027 debye
polarizability: 587.110594|52.857611|167.4243936|-8.8471921|29.9658118|264.6427737 unknown
InChI: InChI=1S/C22H16FNO4S/c1-14-2-6-16(7-3-14)28-17-8-4-15(5-9-17)21-13-22(25)19-12-18(29(23,26)27)10-11-20(19)24-21/h2-13,24H,1H3
charge 0 multiplicity 1
45 atoms
S  7.724766 0.540834 0.19154
F  8.115352 -1.233316 0.604494
O  -4.559801 -0.687408 -1.602236
O  2.995195 1.029074 2.927894
O  8.497295 0.831952 -1.189222
O  7.996668 1.38734 1.528133
N  1.830476 -0.147871 -0.87653
C  3.193938 0.011135 -0.635713
C  3.622926 0.419041 0.666018
C  0.851068 0.088238 0.097075
C  -0.556892 -0.10436 -0.323732
C  2.629603 0.67025 1.758116
C  1.234687 0.487849 1.370207
C  5.005488 0.574341 0.921996
C  5.899375 0.329855 -0.120147
C  4.142632 -0.234895 -1.671385
C  5.510174 -0.078824 -1.416897
C  -0.976318 0.164729 -1.65836
C  -1.528002 -0.569401 0.604191
C  -3.263326 -0.476999 -1.10557
C  -2.313772 -0.018652 -2.049581
C  -2.870195 -0.755519 0.227742
C  -5.681655 -0.747537 -0.719496
C  -8.049562 -0.855798 0.837399
C  -6.605024 -1.789723 -0.933642
C  -5.920702 0.250221 0.249827
C  -7.781003 -1.835817 -0.153986
C  -7.099899 0.182602 1.02331
C  -9.331385 -0.900834 1.650628
H  1.533122 -0.517825 -1.781424
H  0.474454 0.720564 2.119065
H  5.317513 0.886276 1.925625
H  3.806433 -0.546454 -2.66669
H  6.258754 -0.251586 -2.195851
H  -0.271935 0.580353 -2.389542
H  -1.22192 -0.820519 1.625076
H  -2.646092 0.20127 -3.067979
H  -3.597606 -1.132721 0.952104
H  -6.396071 -2.542197 -1.699833
H  -5.207831 1.069011 0.391927
H  -8.499397 -2.647668 -0.317917
H  -7.28721 0.956266 1.777154
H  -9.633634 -1.93928 1.87405
H  -10.167985 -0.42817 1.100365
H  -9.223604 -0.364227 2.608999
