program: Gaussian 09
title: 000292594
version: EM64L-G09RevD.01
frameworkgroup: C1[X(C11H16N2O6S)]
method: RPBEPBE
basis: SDD
operation: Freq
keyword: #p
keyword: freq=noraman
keyword: PBEPBE/SDD
title: #p freq=noraman PBEPBE/SDD
converged: NO YES NO NO
title: Mulliken charges:
elementType: S O O O O O O N N C C C C C C C C C C C H H H H H H H H H H H H H H H H
charge: 0.942420 -0.252666 -0.459050 -0.460460 -0.431594 -0.550378 -0.549361 -0.420295 -0.717481 -0.054906 -0.130965 -0.094571 -0.160282 -0.347776 0.493300 -0.418663 -0.355675 -0.078369 -0.204496 -0.232753 0.228860 0.201193 0.233816 0.270317 0.178949 0.253001 0.313557 0.374212 0.365531 0.336106 0.232360 0.280933 0.279164 0.276551 0.329961 0.329509
chargesum: 0.00000
title: Mulliken charges with hydrogens summed into heavy atoms:
elementType: S O O O O O O N N C C C C C C C C C C C
charge: 0.942420 -0.252666 -0.084838 -0.094929 -0.095488 -0.550378 -0.549361 -0.106738 -0.058012 0.173954 0.070228 0.139245 0.110035 0.084174 0.493300 -0.186303 -0.074741 -0.078369 0.074668 0.043797
polarizability: 2.81162912e+02 3.53240617e+00 1.53974749e+02 3.48471258e+00 1.50751394e+01 1.34101415e+02
1716.lowfreq: -29.5785 -13.3066 -4.9176 -0.0006 0.0005 0.0014 6.0433 24.9184 35.3486
frequency: -29.5679 24.0177 35.3329 40.6070 72.3217 89.3058 94.5723 108.8186 142.4723 166.2976 187.5681 213.5197 228.0215 250.2168 253.3294 264.3687 275.5993 291.4597 300.2498 336.0700 356.2142 365.9497 384.3777 409.9733 415.7047 418.0008 430.6369 443.2960 445.9890 473.2120 486.2307 507.8511 514.7621 532.3735 560.9209 603.6740 627.7126 649.4069 722.1716 790.9697 806.6204 820.2296 824.6459 837.6262 873.7785 899.6384 902.9911 943.5891 955.4306 966.8745 984.6970 992.4211 1004.4415 1006.7968 1049.3152 1053.1497 1058.2250 1067.9399 1077.6357 1120.5498 1123.6657 1164.7721 1178.6610 1186.9420 1191.6169 1212.5745 1240.2167 1272.6485 1286.9445 1292.0539 1296.6998 1311.4579 1329.2808 1340.4284 1352.3098 1373.6577 1375.4704 1379.1705 1398.7737 1426.7725 1460.3718 1473.6927 1511.0863 1530.9413 1590.3673 1610.5122 2908.1976 2925.3293 2955.4293 2992.3386 3075.4130 3102.7008 3132.0930 3154.4509 3163.7700 3176.3877 3359.6837 3527.5745 3530.0001 3543.5299 3543.8910 3555.6802
redmass: 2.7477 6.4349 4.6222 4.7335 6.0289 2.0316 6.8962 5.7259 8.0288 5.7929 4.9747 4.5230 4.7085 4.6384 3.9381 2.9370 4.0832 6.0384 5.5601 1.1633 5.2409 5.0378 3.3769 1.4576 3.1448 2.9152 3.6928 1.2222 2.1504 3.7779 3.3250 4.9771 4.0062 2.7906 3.0190 4.4530 5.7846 5.4323 3.2370 4.0801 2.3127 1.5963 2.3048 1.8140 2.3034 3.9280 4.1222 3.9576 1.3618 1.3933 4.4183 2.9470 5.3027 4.9628 3.6852 2.7138 2.5129 1.4727 3.3923 1.7675 2.0346 2.1296 1.3511 1.1780 1.2358 1.1740 1.2079 1.2107 1.3005 1.4165 1.2144 1.6020 1.4173 1.3877 1.2872 1.3403 2.0670 1.7595 1.7990 4.3978 1.0903 1.8520 2.5725 1.0863 5.7305 6.1139 1.0812 1.0705 1.0838 1.0856 1.0860 1.0945 1.0893 1.0891 1.0956 1.0963 1.0413 1.0997 1.0659 1.0677 1.0734 1.0657
irintensity: 8.1793 0.5069 1.9888 5.9341 3.7001 29.5735 5.4933 0.0960 1.5176 2.4536 1.5422 6.3028 12.8832 4.2846 3.5323 5.3440 11.5801 5.5203 35.9536 69.7236 3.0953 10.5369 16.1739 55.9302 15.4808 15.2640 82.3567 189.9638 57.0299 119.3893 95.6711 66.2619 60.9800 46.1033 48.5470 9.5768 8.2525 15.1151 0.5082 25.1255 202.5491 62.6232 17.8501 77.6072 54.3831 26.9162 75.5067 76.4539 0.5346 0.1708 14.6285 53.6593 134.8879 149.9580 20.6680 72.3635 56.7742 26.4962 14.9055 9.8362 6.9751 21.0125 46.4745 12.0229 52.3935 15.4766 28.1347 9.3119 40.9751 29.6899 5.7722 44.9495 13.7682 38.2643 27.8238 7.4691 24.1608 24.0283 64.2743 3.8550 10.2215 2.6388 322.6398 15.8031 17.3805 346.3506 20.3563 75.6719 17.5226 44.1188 13.4939 17.6977 11.4777 0.4575 4.6697 2.4236 22.0195 20.9112 13.3085 35.1142 29.8060 23.2464
temp: 298.150 k
press: 1.00000 atm
elementType: 16 8 8 8 8 8 8 7 7 6 6 6 6 6 6 6 6 6 6 6 1 1 1 1 1 1 1 1 1 1 1 1 1 1 1 1
symmnumber: 1
zpe: 713678.5 jmol-1
zpe.correction: 0.271826 hartree
zpe.thermalcorrener: 0.292129 hartree
zpe.thermalcorrenthalpy: 0.293073 hartree
zpe.thermalcorrgfe: 0.222456 hartree
zpe.sumelectzpe: -1385.929612 hartree
zpe.sumelectthermal: -1385.909309 hartree
zpe.sumelectthermalent: -1385.908365 hartree
zpe.sumelectthermalfe: -1385.978982 hartree
dipole: -7.6976 -2.3820 3.5121
dipole: 8.7899
quadrupole: -139.1370 -127.9542 -117.9751
quadrupole: -14.3579 5.4222 5.7647
quadrupole: -10.7816 0.4012 10.3804 -14.3579 5.4222 5.7647
hfenergy: -1386.2014381 hartree
pointgroup: C01 [X(C11H16N2O6S1)]
dipole: -2.9504508 -1.7359117 -0.4906243 debye
polarizability: 280.9394251|4.5605655|127.1788349|6.0879916|-5.945548|161.1208153 unknown
InChI: InChI=1S/C11H16N2O6S/c12-20(17,18)7-3-1-6(2-4-7)13-11-10(16)9(15)8(14)5-19-11/h1-4,8-11,13-16H,5,12H2
charge 0 multiplicity 1
36 atoms
S  5.06495 0.187886 0.433508
O  -2.677142 -0.768418 -1.592108
O  -1.993523 1.156429 1.521252
O  -4.863354 1.019424 1.539231
O  -6.041431 -1.271371 0.094431
O  5.901323 1.096978 -0.6330
O  5.173061 0.372829 2.050945
N  -0.779767 0.463363 -1.132356
N  5.56396 -1.561543 0.099866
C  -2.787701 0.747746 0.364369
C  -4.063975 0.024025 0.822681
C  -1.884534 -0.19406 -0.473419
C  -4.822126 -0.580377 -0.36847
C  -3.871487 -1.507264 -1.152645
C  0.560606 0.391294 -0.746952
C  1.5760 0.689096 -1.706717
C  0.938452 0.065849 0.591222
C  3.266092 0.259514 -0.039658
C  2.934358 0.627475 -1.356042
C  2.29803 -0.014177 0.941649
H  -3.079181 1.622224 -0.254491
H  -3.774553 -0.80179 1.517158
H  -1.503274 -1.000905 0.189813
H  -5.202826 0.222559 -1.021487
H  -3.572243 -2.375889 -0.520736
H  -4.344685 -1.878289 -2.074538
H  -0.997165 0.803611 -2.071246
H  -2.572564 1.710549 2.105537
H  -5.772279 0.645338 1.676523
H  -5.784196 -2.099303 0.579026
H  1.292758 0.958429 -2.730945
H  0.16962 -0.04887 1.359545
H  3.720973 0.869798 -2.077457
H  2.603626 -0.236079 1.969153
H  5.884659 -1.966155 0.995934
H  6.306336 -1.539525 -0.619774
