program: Gaussian 09
title: 000292570
version: EM64L-G09RevD.01
frameworkgroup: C1[X(C14H14N2O2)]
method: RPBEPBE
basis: SDD
operation: Freq
keyword: #p
keyword: freq=noraman
keyword: PBEPBE/SDD
title: #p freq=noraman PBEPBE/SDD
converged: NO YES NO NO
title: Mulliken charges:
elementType: O O N N C C C C C C C C C C C C C C H H H H H H H H H H H H H H
charge: -0.210051 -0.216353 -0.442826 0.017514 -0.494197 0.384167 0.514873 -0.381861 -0.383940 0.434505 -0.381534 -0.381529 -0.567576 -0.378034 0.422482 -0.178438 -0.803238 -0.404352 0.223184 0.223076 0.322403 0.238500 0.237988 0.233490 0.233500 0.277655 0.252989 0.230670 0.283623 0.227189 0.227180 0.238941
chargesum: 0.00000
title: Mulliken charges with hydrogens summed into heavy atoms:
elementType: O O N N C C C C C C C C C C C C C C
charge: -0.210051 -0.216353 -0.120423 0.017514 -0.047938 0.384167 0.514873 -0.143361 -0.145952 0.434505 -0.148044 -0.148029 -0.289921 -0.125045 0.422482 0.052232 -0.109928 -0.120729
polarizability: 2.75783368e+02 1.77032748e+01 1.58834584e+02 4.44990626e-01 -1.84319725e-01 1.16367674e+02
1716.lowfreq: -18.9425 -4.9885 -4.6573 -0.0005 -0.0004 0.0005 10.0471 32.1899 38.0337
frequency: -18.6196 32.1827 38.0010 44.0513 58.6040 73.4086 113.7114 170.3342 175.0946 214.8284 226.2439 277.4611 308.4814 366.3353 374.1683 398.2762 414.6107 420.4355 428.0493 471.8913 514.2310 536.0726 539.6371 605.4264 639.2294 660.8028 672.5755 706.5110 716.7999 746.7553 779.0661 793.1166 815.1607 844.2565 852.5738 879.0430 905.8277 906.4685 956.1525 962.8927 975.6792 977.2874 979.4724 998.0972 1014.8260 1048.2287 1081.0395 1085.0297 1100.7750 1124.8167 1177.8539 1192.3473 1201.8291 1216.5496 1220.1699 1223.5561 1262.9491 1312.9174 1313.2014 1345.6931 1367.5433 1378.3683 1380.1583 1397.4895 1406.0756 1441.7377 1471.6286 1473.7525 1476.7937 1493.0796 1510.0382 1512.0443 1580.2650 1586.3365 1626.5979 1632.0707 2935.6465 2975.9975 2977.7572 3059.8638 3088.6509 3117.2344 3118.5871 3138.3509 3143.1902 3144.6535 3161.9086 3168.1675 3199.5453 3570.5853
redmass: 3.8395 5.0938 5.1035 1.0234 7.2722 5.1131 5.2737 5.2578 5.1794 6.0177 3.9048 2.3663 5.3264 2.1063 6.6400 1.7019 1.6538 5.1600 3.2580 4.9834 4.0980 4.9201 3.9787 5.3221 6.7131 8.2411 2.1674 5.0738 3.2908 5.9487 4.1017 1.5099 1.8947 3.2763 1.2456 1.5608 1.4812 3.7305 1.3546 1.5460 1.3822 6.0491 1.3318 1.3897 2.9353 1.5701 2.0451 1.8258 3.3762 1.2905 1.1450 1.1009 1.1041 8.2108 4.5534 2.0744 1.4798 1.3872 1.3383 2.0838 4.2877 5.2443 3.5773 1.2227 2.8865 3.5504 1.0973 1.0540 1.8869 1.2396 2.8108 2.5929 5.4953 6.0835 6.4603 7.0001 1.0572 1.1041 1.0387 1.0950 1.0999 1.0873 1.0876 1.0965 1.0877 1.0976 1.0916 1.0944 1.0953 1.0777
irintensity: 0.6048 0.0396 0.5916 0.4357 0.0105 0.5490 1.8327 0.0441 3.3710 3.0619 0.2633 5.6701 1.9044 8.5955 0.6393 29.9374 34.3400 0.1337 2.4540 4.2023 12.3424 3.9247 19.6734 1.8813 0.0056 8.5966 15.2634 31.9957 1.4885 17.9106 5.1355 37.1389 37.5465 26.1323 0.0193 10.2616 29.9282 3.1095 3.6459 0.1298 0.0282 8.7581 1.3272 1.3567 6.4493 22.1672 10.1068 11.6988 32.0919 11.4294 6.2036 6.8873 0.4073 284.6796 0.1403 0.5920 34.5826 14.8435 8.9624 90.9496 145.7912 0.0864 45.4647 12.1493 1.9864 19.6747 14.9221 13.5499 5.9293 160.5410 205.0282 65.2078 4.0158 0.1132 10.3876 259.1498 53.0832 28.7074 33.2425 20.7099 17.2316 0.0741 26.4606 38.1854 17.2392 0.3655 2.4447 16.5302 5.3190 60.9453
temp: 298.150 k
press: 1.00000 atm
elementType: 8 8 7 7 6 6 6 6 6 6 6 6 6 6 6 6 6 6 1 1 1 1 1 1 1 1 1 1 1 1 1 1
symmnumber: 1
zpe: 658096.9 jmol-1
zpe.correction: 0.250656 hartree
zpe.thermalcorrener: 0.266258 hartree
zpe.thermalcorrenthalpy: 0.267203 hartree
zpe.thermalcorrgfe: 0.205632 hartree
zpe.sumelectzpe: -800.480934 hartree
zpe.sumelectthermal: -800.465331 hartree
zpe.sumelectthermalent: -800.464387 hartree
zpe.sumelectthermalfe: -800.525958 hartree
dipole: -7.2246 3.1868 0.0101
dipole: 7.8963
quadrupole: -121.1800 -107.0687 -101.9486
quadrupole: 21.0291 0.1449 -0.1087
quadrupole: -11.1142 2.9971 8.1172 21.0291 0.1449 -0.1087
hfenergy: -800.7315898 hartree
pointgroup: C01 [X(C14H14N2O2)]
dipole: -2.8495213 1.2373384 -0.0188183 debye
polarizability: 275.5767731|18.3769312|159.0199511|0.1039826|-0.9691755|116.3889016 unknown
InChI: InChI=1S/C14H14N2O2/c1-11-5-7-12(8-6-11)10-15-13-3-2-4-14(9-13)16(17)18/h2-9,15H,10H2,1H3
charge 0 multiplicity 1
32 atoms
O  5.816611 -1.068672 0.019743
O  4.090148 -2.554791 0.034552
N  -0.093251 0.247512 -0.006407
N  4.55561 -1.348548 0.020867
C  -1.153106 1.271326 -0.021221
C  -2.526252 0.61752 -0.008523
C  1.265375 0.535525 -0.007833
C  -3.164227 0.295373 1.215245
C  -3.183596 0.288089 -1.219886
C  -5.090034 -0.666985 0.015728
C  -4.425781 -0.338485 1.226036
C  -4.445294 -0.345631 -1.206892
C  2.216178 -0.527396 0.006609
C  1.751897 1.881259 -0.023355
C  3.58729 -0.220263 0.005487
C  3.13731 2.144862 -0.023785
C  -6.462717 -1.316744 0.028774
C  4.086381 1.102581 -0.009374
H  -1.047876 1.910041 -0.923965
H  -1.044348 1.937693 0.860847
H  -0.391056 -0.727849 0.00193
H  -2.670436 0.541997 2.163207
H  -2.704822 0.52867 -2.177058
H  -4.902859 -0.579199 2.183723
H  -4.937482 -0.592084 -2.155421
H  1.904498 -1.576413 0.018649
H  1.0479 2.718136 -0.035432
H  3.479925 3.185126 -0.035823
H  5.162776 1.282591 -0.009556
H  -6.619998 -1.950261 -0.861535
H  -6.605812 -1.94413 0.92579
H  -7.262652 -0.551045 0.032476
