program: Gaussian 09
title: 000292573
version: EM64L-G09RevD.01
frameworkgroup: C1[X(C15H17N)]
method: RPBEPBE
basis: SDD
operation: Freq
keyword: #pfreq=noraman
keyword: PBEPBE/SDD
title: #p freq=noraman PBEPBE/SDD
converged: YES YES NO NO
title: Mulliken charges:
elementType: N C C C C C C C C C C C C C C C H H H H H H H H H H H H H H H H H
charge: -0.433494 -0.489316 0.419594 0.459689 -0.381753 -0.437492 0.435517 -0.363101 -0.401966 -0.359404 -0.425430 0.444382 -0.433255 -0.339396 -0.806125 -0.814114 0.217608 0.219403 0.294656 0.256011 0.234023 0.229799 0.230120 0.232639 0.213183 0.221097 0.221729 0.224318 0.226862 0.235352 0.224260 0.220559 0.224047
chargesum: 0.00000
title: Mulliken charges with hydrogens summed into heavy atoms:
elementType: N C C C C C C C C C C C C C C C
charge: -0.138837 -0.052305 0.419594 0.459689 -0.125742 -0.203469 0.435517 -0.133302 -0.171846 -0.126766 -0.212247 0.444382 -0.212159 -0.117667 -0.119594 -0.145248
polarizability: 2.75146421e+02 2.44959318e+00 1.44393156e+02 9.24696069e+00 -7.22595606e-01 1.04147262e+02
1716.lowfreq: -2.5177 -2.1042 0.0006 0.0007 0.0009 11.2983 22.5939 29.4136 32.0687
frequency: 20.9061 29.2101 31.8748 34.8670 50.4123 90.4631 131.9176 155.8189 175.4883 258.7137 299.1950 321.5035 332.8822 365.8776 391.1021 410.8945 411.1125 446.2831 459.3147 509.0163 518.9984 557.6522 636.2753 640.3823 710.2836 716.1648 735.5423 770.4259 805.8908 813.6158 815.2053 822.7077 854.6388 860.2221 925.1678 949.3845 952.0521 977.2682 980.0826 982.6477 1001.0469 1002.1044 1015.9456 1045.4128 1047.6841 1094.4522 1123.2250 1132.2783 1190.0621 1192.0159 1205.5214 1220.0649 1223.4230 1228.0272 1274.3812 1309.4344 1317.1264 1343.3580 1369.5833 1381.8701 1397.4633 1397.8322 1406.5744 1418.3423 1462.2039 1470.5773 1471.5313 1474.5510 1483.7535 1493.3218 1510.8511 1525.3602 1583.3791 1586.4038 1626.7472 1638.2708 2912.6391 2965.0775 2967.0379 2975.9277 3041.4910 3055.7822 3074.5084 3085.5246 3102.8820 3114.6848 3115.7652 3116.3853 3128.6409 3137.1534 3144.0734 3152.4912 3561.6300
redmass: 2.4021 1.3268 3.4863 1.0492 3.5983 3.6015 4.0267 3.3591 4.5390 3.3159 2.7356 3.4912 3.1226 2.6478 1.3672 2.4641 2.7087 3.0230 4.9671 2.3850 2.8814 4.3516 6.8570 6.6967 2.8064 3.2473 4.2038 3.6919 1.5492 1.4765 1.5592 4.0832 1.2606 3.2691 1.3090 1.3236 1.3395 1.4083 1.4874 1.4739 1.6500 2.6030 2.5734 1.5066 1.5607 3.8860 1.3104 1.4031 1.1038 1.1005 1.2394 4.1278 2.1465 2.2116 1.6565 1.2920 1.4426 1.9786 3.9102 3.3802 1.2393 1.2470 2.7189 3.5229 1.4151 1.0461 1.0610 1.0876 1.2129 1.1727 2.4925 3.0256 5.0091 6.0382 6.4318 6.5128 1.0646 1.0945 1.0372 1.0381 1.0978 1.0960 1.0981 1.0993 1.0863 1.0872 1.0886 1.0877 1.0965 1.0961 1.0970 1.0944 1.0769
irintensity: 0.1796 0.1809 0.2729 0.5323 0.1297 2.8617 2.3957 0.7142 0.7988 2.9306 1.8592 1.0025 3.5080 0.7058 121.8243 17.3820 7.6036 10.1118 4.1053 20.8894 18.1469 4.1704 0.1306 0.1864 0.8730 0.5283 1.5771 4.3429 34.7019 51.4322 25.8047 10.6871 0.1417 8.5362 0.3202 2.6070 0.8818 0.4483 1.2168 8.2203 2.9237 1.7841 12.5957 9.8731 16.6927 8.5173 14.0869 16.9168 3.4599 9.2307 15.4080 1.5868 0.4248 3.9692 39.0087 1.3723 32.4715 18.9940 48.7217 16.5000 7.7870 8.3838 2.7624 11.9793 62.2419 11.5219 14.4494 16.1880 29.5434 64.0274 10.6091 299.4529 5.2008 2.0094 1.3623 148.1821 68.0851 27.0497 71.8533 38.2716 28.3448 22.2445 21.9295 19.0305 18.9657 7.0704 40.1545 18.5485 31.2266 38.7082 1.1550 18.2644 35.4954
temp: 298.150 k
press: 1.00000 atm
elementType: 7 6 6 6 6 6 6 6 6 6 6 6 6 6 6 6 1 1 1 1 1 1 1 1 1 1 1 1 1 1 1 1 1
symmnumber: 1
zpe: 725339.7 jmol-1
zpe.correction: 0.276267 hartree
zpe.thermalcorrener: 0.292021 hartree
zpe.thermalcorrenthalpy: 0.292965 hartree
zpe.thermalcorrgfe: 0.229949 hartree
zpe.sumelectzpe: -635.403186 hartree
zpe.sumelectthermal: -635.387432 hartree
zpe.sumelectthermalent: -635.386488 hartree
zpe.sumelectthermalfe: -635.449504 hartree
dipole: -2.2568 -0.1849 -0.3500
dipole: 2.2913
quadrupole: -84.9899 -89.8592 -97.7073
quadrupole: 0.9113 1.2367 0.7010
quadrupole: 5.8622 0.9929 -6.8552 0.9113 1.2367 0.7010
hfenergy: -635.6794529 hartree
pointgroup: C01 [X(C15H17N1)]
dipole: -0.8853316 -0.1517569 -0.0759872 debye
polarizability: 274.7247203|9.460021|127.2182337|8.6539427|-19.7123908|121.7438857 unknown
InChI: InChI=1S/C15H17N/c1-12-3-7-14(8-4-12)11-16-15-9-5-13(2)6-10-15/h3-10,16H,11H2,1-2H3
charge 0 multiplicity 1
33 atoms
N  0.443525 -0.316793 -0.150385
C  -0.44185 0.784603 -0.54518
C  -1.904671 0.421874 -0.325327
C  1.835696 -0.197579 -0.059065
C  -2.355117 -0.027742 0.943544
C  -2.849675 0.538295 -1.371482
C  -4.666838 -0.225405 0.108604
C  -3.712202 -0.348203 1.153711
C  -4.211104 0.221662 -1.156462
C  2.508878 1.041173 -0.262586
C  2.625437 -1.342945 0.263212
C  4.702818 -0.008947 0.193862
C  3.913529 1.120262 -0.129749
C  4.022411 -1.243301 0.383172
C  -6.131924 -0.546889 0.350429
C  6.213706 0.083135 0.330388
H  -0.286113 1.076889 -1.60854
H  -0.185316 1.675918 0.065752
H  0.044242 -1.25512 -0.174529
H  -1.63392 -0.124115 1.763839
H  -2.520094 0.873646 -2.36266
H  -4.039889 -0.694427 2.142037
H  -4.925908 0.317884 -1.98275
H  1.947174 1.941049 -0.532269
H  2.130462 -2.309633 0.424386
H  4.404658 2.088575 -0.289817
H  4.600083 -2.143015 0.632195
H  -6.681461 -0.670188 -0.598766
H  -6.251145 -1.475926 0.936946
H  -6.628771 0.262919 0.919118
H  6.73037 -0.572075 -0.397295
H  6.569548 1.114453 0.160121
H  6.551561 -0.223529 1.339046
