program: Gaussian 09
title: 000292559
version: EM64L-G09RevD.01
frameworkgroup: C1[X(C15H14N2O)]
method: RPBEPBE
basis: SDD
operation: Freq
keyword: #p
keyword: freq=noraman
keyword: PBEPBE/SDD
title: #p freq=noraman PBEPBE/SDD
converged: YES YES NO NO
title: Mulliken charges:
elementType: O N N C C C C C C C C C C C C C C C H H H H H H H H H H H H H H
charge: -0.277912 -0.403637 -0.377233 -0.352785 0.552298 0.330187 0.141649 0.110372 -0.484662 -0.469674 -0.411915 0.444461 -0.336562 -0.208943 -0.427525 -0.196393 -0.268759 -0.810847 0.242402 0.294676 0.321150 0.252931 0.229833 0.220608 0.271161 0.227811 0.235987 0.225004 0.229952 0.234622 0.222252 0.239490
chargesum: 0.00000
title: Mulliken charges with hydrogens summed into heavy atoms:
elementType: O N N C C C C C C C C C C C C C C C
charge: -0.277912 -0.108961 -0.056083 -0.110383 0.552298 0.330187 0.141649 0.110372 -0.231731 -0.239841 -0.191307 0.444461 -0.065401 0.018868 -0.191538 0.028611 -0.038806 -0.114483
polarizability: 2.20861966e+02 2.66639919e+01 1.51371504e+02 1.95137730e+01 4.80806271e+00 1.56352324e+02
1716.lowfreq: -23.7033 -4.7618 -0.0008 -0.0005 -0.0003 1.3536 7.2395 15.7434 25.7706
frequency: -22.8616 15.5014 25.7337 53.9076 114.6248 149.9313 175.8865 209.5843 225.0315 273.1313 299.9189 307.4877 357.0926 413.2811 431.2978 459.4563 471.5883 483.2464 515.3845 517.6978 525.3012 569.6014 589.7527 608.5773 630.9439 686.6969 711.0241 714.1140 737.2283 756.0918 773.7676 791.7744 807.7089 858.4794 868.4940 899.8515 911.8453 920.8108 961.5249 971.3354 983.5016 987.9694 988.9331 1005.2040 1031.9051 1050.6133 1071.6853 1098.2047 1120.7475 1151.8325 1169.2992 1170.6200 1182.6585 1245.9721 1255.9317 1269.9407 1291.0430 1303.4337 1338.7950 1354.8215 1383.1097 1396.5951 1399.0900 1419.7850 1437.8302 1442.5230 1469.7737 1473.3218 1483.6683 1485.4198 1504.9999 1585.2654 1596.5483 1612.8148 1616.7852 1633.7175 2957.4653 2979.7435 3059.7190 3087.2500 3106.8272 3118.4211 3124.6567 3125.9273 3138.8555 3149.9185 3152.5092 3169.8852 3539.2933 3561.7634
redmass: 1.1783 2.6462 4.9958 5.8546 4.8733 4.4803 4.8732 3.1819 4.4837 5.2365 4.0789 4.9343 2.7806 3.1834 2.6740 2.1278 2.8152 6.7819 2.7166 4.9797 4.4310 4.6747 2.1338 2.7793 5.0162 3.1873 3.3457 2.6075 4.9346 1.9514 2.2337 2.3278 2.4856 1.5057 4.9051 1.3229 3.0500 1.4724 1.3591 3.3469 1.3541 1.3279 5.8214 1.6289 2.0806 1.5752 3.8089 1.6686 1.8002 1.8321 1.0714 2.2813 1.0929 2.7249 1.5538 2.6530 1.5335 1.5532 1.4929 1.8576 4.0038 5.2606 1.2986 1.8666 2.0825 2.0286 1.0590 1.7268 1.4618 2.4416 2.7199 5.2198 5.7166 5.7090 6.0567 6.8943 1.0864 1.0374 1.0972 1.0992 1.0883 1.0869 1.0903 1.0910 1.0900 1.0927 1.0987 1.0998 1.0765 1.0768
irintensity: 0.3673 0.5250 0.1116 2.3740 0.4709 2.2598 0.4444 2.2248 3.7168 4.6010 8.0728 2.4861 0.1437 10.9770 10.2477 51.7818 28.9418 12.1776 18.1611 2.9713 22.0587 7.2860 37.7689 10.1605 44.6996 72.3999 10.9375 26.9148 32.8255 100.7641 10.9401 19.7494 19.4924 1.7594 4.7065 0.6803 3.2532 4.1144 2.6707 8.1563 0.1769 0.4278 1.8958 2.8971 12.7749 11.7331 9.0433 20.4084 31.8889 30.6419 5.4646 27.9901 2.2259 2.8408 3.4976 15.5074 47.4394 8.2654 89.0979 35.6605 2.2808 21.3353 15.8571 77.6694 11.1311 7.0293 13.4679 16.0184 12.8140 15.0198 229.6741 24.5766 3.9063 222.7345 15.6136 324.4715 59.4405 24.2230 16.2317 19.7012 7.5997 8.5604 13.3318 11.4712 14.3386 9.4311 33.0165 23.9954 32.9161 23.0732
temp: 298.150 k
press: 1.00000 atm
elementType: 8 7 7 6 6 6 6 6 6 6 6 6 6 6 6 6 6 6 1 1 1 1 1 1 1 1 1 1 1 1 1 1
symmnumber: 1
zpe: 670395.1 jmol-1
zpe.correction: 0.255340 hartree
zpe.thermalcorrener: 0.269705 hartree
zpe.thermalcorrenthalpy: 0.270649 hartree
zpe.thermalcorrgfe: 0.212183 hartree
zpe.sumelectzpe: -763.488936 hartree
zpe.sumelectthermal: -763.474571 hartree
zpe.sumelectthermalent: -763.473627 hartree
zpe.sumelectthermalfe: -763.532093 hartree
dipole: -3.6127 1.4455 -3.9772
dipole: 5.5641
quadrupole: -100.6350 -100.9331 -106.0420
quadrupole: 8.3701 -4.8523 7.9128
quadrupole: 1.9017 1.6036 -3.5053 8.3701 -4.8523 7.9128
hfenergy: -763.744276 hartree
pointgroup: C01 [X(C15H14N2O1)]
dipole: 1.3702857 -1.5297997 -0.7576843 debye
polarizability: 216.886232|4.1836212|149.0980054|-36.1334929|2.6223079|162.6015564 unknown
InChI: InChI=1S/C15H14N2O/c1-10-5-4-6-11(9-10)14-16-13-8-3-2-7-12(13)15(18)17-14/h2-9,14,16-17H,1H3
charge 0 multiplicity 1
32 atoms
O  -1.653145 2.853154 0.564462
N  -0.62518 -0.528973 -1.565998
N  -0.280311 1.763975 -0.953732
C  0.347658 0.582287 -1.571806
C  1.686919 0.196189 -0.911551
C  -1.631413 -0.658269 -0.607879
C  -2.005404 0.471265 0.183039
C  -1.322952 1.7750 -0.022846
C  1.790229 0.031911 0.490853
C  2.823002 -0.026468 -1.726002
C  -2.327697 -1.887266 -0.431591
C  3.009155 -0.361509 1.095992
C  -3.051343 0.360037 1.127977
C  4.046262 -0.419173 -1.138272
C  4.136019 -0.587141 0.261499
C  -3.366504 -1.977747 0.514569
C  -3.73603 -0.857774 1.304648
C  3.106984 -0.521728 2.60338
H  0.566253 0.825202 -2.633031
H  -0.326569 -1.369966 -2.060402
H  0.202247 2.657824 -1.073978
H  0.912502 0.217239 1.122843
H  2.75268 0.110035 -2.813443
H  -2.051526 -2.761697 -1.033577
H  -3.308097 1.25612 1.7032
H  4.927737 -0.59017 -1.766242
H  5.087947 -0.890347 0.713724
H  -3.892201 -2.931335 0.64046
H  -4.545216 -0.940736 2.036692
H  2.306204 -1.177613 2.991221
H  4.076734 -0.954483 2.903209
H  3.001854 0.453553 3.11538
