program: Gaussian 09
title: 000292554
version: EM64L-G09RevD.01
frameworkgroup: C1[X(C11H15NO)]
method: RPBEPBE
basis: SDD
operation: Freq
keyword: #p
keyword: freq=noraman
keyword: PBEPBE/SDD
title: #p freq=noraman PBEPBE/SDD
converged: YES YES NO NO
title: Mulliken charges:
elementType: O N C C C C C C C C C C C H H H H H H H H H H H H H H H
charge: -0.478836 -0.395632 -0.178102 -0.457569 0.448714 -0.419729 -0.404524 -0.392937 -0.229488 -0.219261 -0.243171 -0.075781 -0.566706 0.205225 0.207503 0.254484 0.286852 0.226263 0.282108 0.206028 0.232944 0.361568 0.221899 0.222712 0.225130 0.238539 0.222667 0.219100
chargesum: 0.00000
title: Mulliken charges with hydrogens summed into heavy atoms:
elementType: O N C C C C C C C C C C C
charge: -0.117268 -0.108779 0.027123 0.004418 0.448714 -0.193466 -0.122417 0.046035 -0.007589 0.003451 -0.018041 0.162758 -0.124940
polarizability: 1.89893553e+02 -2.20185522e+00 1.19378638e+02 -3.63581079e+00 4.10287011e+00 7.41016707e+01
1716.lowfreq: -13.0805 -4.4273 -0.0005 -0.0003 0.0009 1.5928 32.4413 34.4832 50.3974
frequency: 32.3637 34.4527 50.2499 69.0093 98.7158 118.4257 203.6735 240.6766 256.1991 307.6687 371.2325 404.1098 416.7201 423.1199 511.4496 555.1647 607.1913 615.8811 641.5088 688.0571 706.9852 742.8253 759.8532 815.6613 858.2112 886.0986 897.1716 921.8161 949.8979 957.0433 960.9135 980.1340 988.9364 1000.4448 1009.1612 1023.7217 1035.3079 1072.5794 1089.3655 1121.9809 1144.7360 1169.1925 1177.6745 1196.1039 1212.4059 1227.3195 1267.2024 1280.9367 1293.0632 1321.7962 1331.1367 1338.8667 1386.5422 1394.5165 1428.3746 1437.0832 1442.0319 1451.8463 1477.8857 1482.5837 1593.3775 1614.5742 1661.1939 2909.2508 2914.8263 2942.1756 2999.3131 3057.8594 3087.8305 3107.6808 3108.1723 3123.6889 3137.5267 3155.9331 3171.0575 3199.1080 3217.9139 3474.1517
redmass: 4.1072 4.0197 2.9345 2.6423 3.6894 3.6801 3.9376 2.5460 4.0062 2.9517 4.1693 2.8604 2.1055 2.8453 3.4026 2.6815 2.2400 6.2805 2.4429 1.3288 1.7826 1.2485 1.6351 3.1316 1.2498 3.0237 1.6304 1.3965 1.6078 2.1873 1.5635 1.3645 5.8256 1.3395 1.1393 2.2879 3.0888 2.0567 1.7885 3.9300 1.8697 1.0679 1.1400 1.4605 1.7486 1.2521 1.2116 1.2397 1.2193 1.2486 1.2463 1.2885 6.6391 1.5498 1.1858 2.0674 1.2590 1.0954 1.0853 2.3837 6.2119 6.1509 4.7197 1.0813 1.0680 1.0670 1.0927 1.0959 1.0602 1.0874 1.0944 1.0866 1.0928 1.0979 1.0965 1.1143 1.0635 1.0759
irintensity: 1.1121 0.1269 1.0960 0.6031 1.8702 1.1220 2.8123 6.7841 0.8108 9.9804 8.8115 0.2425 1.7726 2.2492 7.4094 14.1243 37.4505 0.3058 7.0977 48.0679 53.2247 61.9624 89.3346 5.9540 0.4446 28.5624 2.3631 7.7120 52.3033 6.2867 51.9790 0.2543 0.0431 1.0902 26.7117 17.1278 28.9168 9.7478 3.1548 73.8365 2.6396 0.7932 4.7675 40.9402 5.8090 19.1371 11.4130 1.5165 9.1668 1.6254 30.9080 12.5664 6.7005 75.4738 10.8384 12.2702 8.0076 10.4546 6.4928 17.5108 0.3024 9.4174 8.8880 35.9241 74.3473 61.7703 22.8262 20.7677 12.4229 13.3534 8.7048 1.4203 35.9932 31.5107 11.0128 26.3592 207.4571 2.8370
temp: 298.150 k
press: 1.00000 atm
elementType: 8 7 6 6 6 6 6 6 6 6 6 6 6 1 1 1 1 1 1 1 1 1 1 1 1 1 1 1
symmnumber: 1
zpe: 618235.5 jmol-1
zpe.correction: 0.235473 hartree
zpe.thermalcorrener: 0.248499 hartree
zpe.thermalcorrenthalpy: 0.249443 hartree
zpe.thermalcorrgfe: 0.194018 hartree
zpe.sumelectzpe: -557.121015 hartree
zpe.sumelectthermal: -557.107989 hartree
zpe.sumelectthermalent: -557.107045 hartree
zpe.sumelectthermalfe: -557.162470 hartree
dipole: 2.2411 -2.2622 1.8350
dipole: 3.6753
quadrupole: -68.2719 -76.8394 -81.5001
quadrupole: 0.2786 0.3079 3.5384
quadrupole: 7.2652 -1.3022 -5.9630 0.2786 0.3079 3.5384
hfenergy: -557.356488 hartree
pointgroup: C01 [X(C11H15N1O1)]
dipole: -1.0357951 0.6329148 0.7857056 debye
polarizability: 188.2777601|5.4933257|119.760293|12.1688696|4.9313883|75.3358091 unknown
InChI: InChI=1S/C11H15NO/c1-2-8-12-9-11(13)10-6-4-3-5-7-10/h2-7,11-13H,1,8-9H2
charge 0 multiplicity 1
28 atoms
O  -0.122372 -1.582846 -0.961056
N  -2.209166 -0.684657 0.447047
C  0.021678 -0.200147 -0.52369
C  -0.91763 -0.007186 0.717428
C  1.467305 0.114684 -0.169613
C  1.889837 1.463009 -0.05004
C  2.393679 -0.92539 0.084091
C  -3.195949 0.091397 -0.351289
C  3.214791 1.768327 0.334513
C  3.72043 -0.620286 0.463789
C  4.134903 0.725858 0.595415
C  -4.414704 -0.750607 -0.660336
C  -5.689118 -0.395167 -0.362336
H  -0.310959 0.488273 -1.334267
H  -1.025326 1.074627 0.951473
H  -0.44584 -0.502537 1.584949
H  -2.638697 -1.084602 1.289754
H  1.187102 2.278101 -0.268056
H  2.058877 -1.959101 -0.043041
H  -3.500876 1.034474 0.157897
H  -2.702014 0.381265 -1.300344
H  -1.05955 -1.816502 -0.661731
H  3.531238 2.814069 0.422895
H  4.433268 -1.431969 0.65047
H  5.164612 0.960817 0.888331
H  -4.211343 -1.707549 -1.162454
H  -6.538909 -1.036131 -0.62165
H  -5.919266 0.550972 0.143956
