program: Gaussian 09
title: 000292547
version: EM64L-G09RevD.01
frameworkgroup: C1[X(C7H9NO2)]
method: RPBEPBE
basis: SDD
operation: Freq
keyword: #pfreq=noraman
keyword: PBEPBE/SDD
title: #p freq=noraman PBEPBE/SDD
converged: YES YES NO YES
title: Mulliken charges:
elementType: O O N C C C C C C C H H H H H H H H H
charge: -0.405975 -0.239178 -0.015610 -0.168584 -0.674192 -0.674189 -0.166305 0.158217 0.131780 -0.214232 0.251036 0.227004 0.213335 0.234304 0.227003 0.213338 0.234298 0.278422 0.389526
chargesum: 0.00000
title: Mulliken charges with hydrogens summed into heavy atoms:
elementType: O O N C C C C C C C
charge: -0.016448 -0.239178 -0.015610 0.082451 0.000451 0.000451 0.112118 0.158217 0.131780 -0.214232
polarizability: 1.14849676e+02 7.42446102e+00 9.75487689e+01 1.29604541e-03 -2.74541167e-03 5.70835202e+01
1716.lowfreq: -5.4012 -3.9898 -0.0008 -0.0007 0.0004 11.8179 38.6752 64.1591 98.8525
frequency: 38.2553 64.1391 98.8384 113.5711 149.3668 208.4637 239.1042 246.7981 276.0184 345.6150 408.0172 409.1295 449.5130 499.7668 559.8265 626.0187 631.6898 733.3885 760.4747 840.5871 926.1585 942.4117 951.7072 966.3700 1030.2060 1087.3169 1096.8133 1162.5368 1204.1005 1289.1293 1302.2326 1333.3363 1350.8084 1377.1910 1396.4444 1464.7995 1468.1179 1477.4256 1488.2258 1609.0912 1645.5324 2180.0846 2981.1866 2982.3348 3013.3690 3077.6750 3083.6419 3088.6635 3091.8762 3098.5999 3528.5715
redmass: 3.1754 8.0234 3.5126 5.4176 6.8992 1.0369 1.0757 6.6313 3.3710 3.9340 3.2020 3.0743 3.7683 10.5070 2.1585 4.5992 1.7528 7.4232 4.8645 2.5720 1.1802 2.1017 1.2793 1.6366 2.8102 2.6431 1.8868 1.9350 2.1703 1.5531 1.3010 2.4327 1.5945 1.1802 1.2191 1.0497 1.0437 1.0489 1.0600 7.8148 9.2091 12.6249 1.0348 1.0352 1.0852 1.1004 1.0993 1.1009 1.1001 1.0897 1.0643
irintensity: 0.0096 4.4256 0.0145 1.6582 3.1225 0.0006 0.1047 0.0194 1.5017 0.8649 9.0035 0.9025 8.4367 3.0048 48.8616 55.9257 106.6880 23.8037 2.6579 1.8669 3.9085 138.1641 3.7456 5.4141 53.7167 2.4738 196.7469 12.6234 4.3824 25.0678 0.0211 69.4429 2.1453 13.4599 5.1348 7.9973 1.1526 12.6615 15.3194 135.9595 199.3563 10.1534 24.1287 29.1168 3.0667 0.9011 53.5222 21.6069 29.2061 3.9990 55.1975
temp: 298.150 k
press: 1.00000 atm
elementType: 8 8 7 6 6 6 6 6 6 6 1 1 1 1 1 1 1 1 1
symmnumber: 1
zpe: 385164.9 jmol-1
zpe.correction: 0.146702 hartree
zpe.thermalcorrener: 0.157856 hartree
zpe.thermalcorrenthalpy: 0.158800 hartree
zpe.thermalcorrgfe: 0.109107 hartree
zpe.sumelectzpe: -476.566683 hartree
zpe.sumelectthermal: -476.555529 hartree
zpe.sumelectthermalent: -476.554585 hartree
zpe.sumelectthermalfe: -476.604278 hartree
dipole: -2.0451 -2.4009 0.0007
dipole: 3.1538
quadrupole: -46.3114 -75.6742 -58.4508
quadrupole: -2.2562 0.0011 -0.0001
quadrupole: 13.8341 -15.5287 1.6946 -2.2562 0.0011 -0.0001
hfenergy: -476.7133848 hartree
pointgroup: C01 [X(C7H9N1O2)]
dipole: -0.8080982 0.9415762 -0.0008924 debye
dipolederiv: -1.1906605 0.3852167 -0.0000729 0.4002389 -0.4335317 -0.000022 -0.0000679 -0.0000779 -0.4101182 -0.6788239 -0.1822885 0.0001212 -0.1651776 -1.0364477 0.0002814 0.000067 0.0003612 -0.3235235 -0.2133756 -0.0003307 0.0000436 0.0178028 -0.3188988 -0.0003415 0.0001021 -0.0000515 -0.2366535 -0.2160348 -0.0013067 -0.0000201 0.1433816 0.0574636 -0.0000114 -0.000118 -0.0000205 0.0224341 -0.0273266 0.0218036 0.0395063 -0.1497163 0.1179984 0.0091896 -0.1129515 -0.0035453 0.0167114 -0.0273289 0.0217585 -0.0395333 -0.1496135 0.117997 -0.0092831 0.1131093 0.003453 0.0167283 0.7914367 -0.1106735 0.0000806 -0.0687449 -0.0058449 -0.0000108 0.0000283 -0.0001038 -0.1146853 -0.7941112 -0.0396143 0.0000367 -0.0601878 -0.0289657 0.0000942 0.0000818 -0.0000553 0.060823 1.9101251 0.0431117 -0.0001703 0.2043459 1.292517 -0.0004061 -0.0001198 -0.0004465 0.2801643 -0.0317774 -0.0742458 -0.000029 -0.0430564 0.2370821 0.0002298 -0.0002081 0.0001683 0.0421255 0.0367337 0.0510814 -0.0000094 0.0067057 -0.1015768 0.0000609 0.0000202 0.0000621 0.0358737 -0.1552573 -0.0658307 0.0329163 -0.077456 0.0510218 -0.0150209 0.0443156 -0.0332132 0.0759118 0.1001434 -0.0037278 0.0201163 0.0498152 -0.1497949 -0.0310741 0.0014359 0.0360466 0.071996 0.0573971 0.0381169 -0.1065681 0.0395488 0.0713581 0.0538121 -0.0586583 0.0392385 -0.0997478 -0.1552723 -0.065854 -0.0328668 -0.0774944 0.051074 0.0150395 -0.0442541 0.0332347 0.0758645 0.1001497 -0.0037562 -0.0201079 0.0498042 -0.1497997 0.0312792 -0.0014776 -0.0358452 0.0719987 0.0573921 0.0382198 0.1065424 0.0396041 0.0712688 -0.0539742 0.0586238 -0.0394053 -0.0996625 0.1028105 0.0248249 -0.0000215 -0.023181 -0.0021353 0.0000384 -0.0000008 0.0000844 0.1133299 0.3337803 -0.0765052 0.0000358 -0.1366192 0.1592149 0.0001191 0.000072 0.0001158 0.4004295 unknown
polarizability: 114.9045089|-7.3600924|97.4939139|0.0025517|-0.0302065|57.0835427 unknown
InChI: InChI=1S/C7H9NO2/c1-5(2)3-6(4-8)7(9)10/h3,5,9H,1-2H3
charge 0 multiplicity 1
19 atoms
O  2.919289 0.002935 -0.000329
O  1.802678 2.044495 -0.001069
N  0.716267 -2.671756 0.002083
C  -2.046828 -0.062428 -0.000026
C  -2.826495 0.356701 1.27935
C  -2.826466 0.355561 -1.279797
C  -0.690823 0.590459 -0.000322
C  0.528197 -0.043484 -0.000123
C  1.770029 0.792041 -0.000475
C  0.644533 -1.47778 0.0004
H  -1.929221 -1.16246 0.000466
H  -3.826508 -0.11312 1.276063
H  -2.964182 1.453396 1.31891
H  -2.298997 0.040094 2.196023
H  -3.826497 -0.114219 -1.27609
H  -2.964107 1.452226 -1.320361
H  -2.298967 0.038092 -2.196171
H  -0.665125 1.691667 -0.000756
H  3.725818 0.585981 -0.000675
