program: Gaussian 09
title: 000292560
version: EM64L-G09RevD.01
frameworkgroup: C1[X(C16H16N2O2)]
method: RPBEPBE
basis: SDD
operation: Freq
keyword: #p
keyword: freq=noraman
keyword: PBEPBE/SDD
title: #p freq=noraman PBEPBE/SDD
converged: YES YES NO NO
title: Mulliken charges:
elementType: O O N N C C C C C C C C C C C C C C C C H H H H H H H H H H H H H H H H
charge: -0.269621 -0.290569 -0.437110 -0.383477 -0.271983 0.377284 0.380144 0.151306 0.130037 0.242283 -0.428371 -0.429945 -0.345228 -0.360319 -0.250603 -0.199481 -0.281420 -0.235205 -0.245427 -0.682050 0.231538 0.292883 0.316428 0.230499 0.218159 0.268714 0.248511 0.231413 0.222189 0.228030 0.228735 0.211607 0.207348 0.202931 0.241804 0.248965
chargesum: 0.00000
title: Mulliken charges with hydrogens summed into heavy atoms:
elementType: O O N N C C C C C C C C C C C C C C C C
charge: -0.269621 -0.290569 -0.144227 -0.067050 -0.040445 0.377284 0.380144 0.151306 0.130037 0.242283 -0.197872 -0.211786 -0.076513 -0.111807 -0.019190 0.022708 -0.053390 -0.006470 0.173529 0.011650
polarizability: 2.63013583e+02 -3.25887842e+01 1.59679438e+02 5.17691668e-01 4.44146669e+00 1.54929152e+02
1716.lowfreq: -4.1968 -0.0008 0.0003 0.0005 3.7936 8.2709 18.7840 42.7963 57.3838
frequency: 16.6819 42.7915 57.3715 71.9706 97.8310 119.5334 139.6434 151.7079 205.5692 218.6530 238.5399 256.1193 259.3552 277.8355 326.4343 348.3624 413.3994 427.5067 441.2254 455.7570 481.7310 498.2486 516.4881 527.1526 563.6131 580.5464 589.6773 605.8709 634.0629 688.6476 715.4705 744.5325 751.0332 756.3474 758.7928 774.6688 797.9087 820.9582 823.7707 855.7524 856.7363 868.2305 907.9860 937.6092 958.0600 970.0685 976.8539 985.7946 1029.6978 1031.4957 1047.6206 1077.1347 1108.0167 1121.1458 1123.3748 1133.6827 1167.7334 1173.4637 1176.0561 1180.7213 1225.5678 1254.9992 1260.6658 1264.4761 1271.4911 1303.5862 1340.7824 1355.9338 1367.4936 1396.3520 1399.1890 1404.0375 1425.4953 1437.6755 1443.1590 1459.5790 1472.1956 1481.9855 1488.2038 1492.7292 1514.1363 1586.1540 1590.9092 1604.8465 1613.3051 1635.5621 2910.3560 2957.4115 2997.0623 3018.3763 3093.5722 3106.5616 3110.4598 3115.0713 3134.7289 3135.7337 3146.3591 3158.4342 3167.3443 3171.1796 3536.7730 3570.5118
redmass: 4.3470 5.0407 5.7303 3.7431 4.3688 2.0353 4.5307 3.9180 4.7188 4.3525 3.3307 1.3516 4.1522 5.7440 4.2738 3.5926 3.1423 4.2682 1.8240 2.5190 6.2199 4.6501 2.9779 4.7366 4.7196 3.6152 5.2818 1.9693 5.1435 2.9801 5.3998 4.1977 2.7152 1.7474 1.4976 2.5138 5.5379 4.6438 1.1261 1.5181 1.5798 3.7956 3.7563 1.3837 1.3542 3.8796 1.3194 1.3258 2.6449 2.1010 2.2577 3.6160 2.3759 2.0960 1.7748 1.4346 1.0747 1.2834 2.3466 1.9068 3.3215 1.5104 1.1480 1.8083 1.7643 1.7278 1.6598 1.8973 1.4036 2.6242 5.0282 1.2714 1.9186 2.2093 2.2693 1.0385 1.2987 1.2706 2.3894 1.3796 3.0170 5.1324 6.7181 6.1203 5.6556 6.9539 1.0851 1.0552 1.0368 1.1077 1.0988 1.0888 1.1017 1.0867 1.0874 1.0898 1.0927 1.0933 1.0998 1.0985 1.0762 1.0767
irintensity: 1.4657 0.0427 2.1776 0.4066 0.2385 3.3680 0.0350 0.9793 1.7262 0.8329 1.5093 0.7377 5.6725 7.0696 5.5928 1.5969 13.5934 2.3627 50.3420 34.4348 7.5549 17.7817 4.4398 7.0659 6.6332 23.1937 2.4744 30.6405 39.0858 80.9753 5.4657 12.7139 13.1648 111.7166 86.9816 3.9102 7.3605 39.1948 1.2917 0.8151 1.1496 4.2730 27.7114 2.1530 3.2138 4.8782 0.0136 0.5864 44.1482 23.5814 10.6872 3.7523 25.4113 7.7021 43.2099 4.7021 4.8962 3.5097 25.8620 27.8173 111.6951 1.3427 0.3441 5.8437 16.4047 22.2503 83.0568 55.4194 2.3352 21.3734 23.0196 20.6348 90.1518 39.4825 13.5019 14.3808 60.8798 13.6906 3.8206 17.5431 263.9030 40.2439 9.9599 47.8840 212.0204 349.1319 81.6088 42.7161 17.7862 29.0289 30.6454 12.1286 20.0433 9.4714 6.2793 14.9386 11.3050 27.0061 27.5535 17.7564 27.4712 24.4315
temp: 298.150 k
press: 1.00000 atm
elementType: 8 8 7 7 6 6 6 6 6 6 6 6 6 6 6 6 6 6 6 6 1 1 1 1 1 1 1 1 1 1 1 1 1 1 1 1
symmnumber: 1
zpe: 755462.6 jmol-1
zpe.correction: 0.287741 hartree
zpe.thermalcorrener: 0.305064 hartree
zpe.thermalcorrenthalpy: 0.306008 hartree
zpe.thermalcorrgfe: 0.241757 hartree
zpe.sumelectzpe: -877.839650 hartree
zpe.sumelectthermal: -877.822327 hartree
zpe.sumelectthermalent: -877.821383 hartree
zpe.sumelectthermalfe: -877.885634 hartree
dipole: 3.9210 0.7108 -4.1503
dipole: 5.7537
quadrupole: -109.9721 -103.4371 -124.4437
quadrupole: -4.5237 7.8186 1.4346
quadrupole: 2.6455 9.1806 -11.8261 -4.5237 7.8186 1.4346
hfenergy: -878.1273909 hartree
pointgroup: C01 [X(C16H16N2O2)]
dipole: 1.5189244 0.5814491 -1.574469 debye
polarizability: 251.6532053|-42.8969136|166.055039|-15.9713092|9.3334022|159.9139288 unknown
InChI: InChI=1S/C16H16N2O2/c1-2-20-14-10-6-4-8-12(14)15-17-13-9-5-3-7-11(13)16(19)18-15/h3-10,15,17-18H,2H2,1H3
charge 0 multiplicity 1
36 atoms
O  0.889569 1.135488 0.267629
O  -1.459919 -0.861145 2.699356
N  -0.514191 -1.075696 -1.318338
N  -0.096363 -1.619148 0.98846
C  0.470893 -1.626443 -0.373821
C  1.845014 -0.935971 -0.457446
C  -1.650846 -0.35813 -0.960722
C  -2.034734 -0.260913 0.410074
C  -1.200665 -0.904576 1.454099
C  2.033571 0.441438 -0.126629
C  2.964876 -1.692016 -0.866684
C  -2.461317 0.266237 -1.95149
C  -3.206314 0.441668 0.770107
C  3.323539 1.022475 -0.209039
C  4.255625 -1.120584 -0.955976
C  -3.623421 0.965321 -1.572937
C  -4.0080 1.060002 -0.209533
C  4.425578 0.240083 -0.62371
C  1.033239 2.539827 0.717409
C  -0.342816 2.998209 1.190131
H  0.65567 -2.687806 -0.655674
H  -0.222371 -1.063781 -2.295009
H  0.484696 -2.037081 1.719303
H  2.81973 -2.752031 -1.115871
H  -2.177303 0.200491 -3.009248
H  -3.460837 0.483849 1.834825
H  3.478851 2.075259 0.043315
H  5.109518 -1.726454 -1.274908
H  -4.236982 1.440072 -2.34765
H  -4.915816 1.602096 0.073151
H  5.417625 0.701527 -0.684112
H  1.777063 2.581652 1.538971
H  1.39989 3.155223 -0.129764
H  -0.289982 4.049524 1.528139
H  -1.083492 2.925573 0.37613
H  -0.693978 2.374458 2.029159
