program: Gaussian 09
title: 000292753
version: EM64L-G09RevD.01
frameworkgroup: C1[X(C23H27Cl2N5O)]
method: RPBEPBE
basis: SDD
operation: Freq
keyword: #p
keyword: freq=noraman
keyword: PBEPBE/SDD
title: #p freq=noraman PBEPBE/SDD
converged: YES YES NO NO
title: Mulliken charges:
elementType: Cl Cl O N N N N N C C C C C C C C C C C C C C C C C C C C C C C H H H H H H H H H H H H H H H H H H H H H H H H H H H
charge: -0.025567 -0.024098 -0.270266 -0.117276 -0.500128 -0.114031 -0.425314 -0.108346 -0.498691 0.332207 -0.326080 -0.319430 -0.477641 0.137591 0.499431 -0.684546 -0.682561 -0.346189 -0.498556 0.267670 -0.529706 -0.535572 0.273480 -0.049451 0.481194 -0.773442 -0.467410 -0.309444 -0.030863 -0.206034 -0.137007 0.236470 0.223424 0.178188 0.207848 0.179583 0.226345 0.319220 0.226550 0.227178 0.207602 0.232253 0.204774 0.213077 0.239314 0.234152 0.306803 0.230641 0.244466 0.218598 0.221148 0.331444 0.218715 0.245271 0.245157 0.256170 0.332317 0.259369
chargesum: 0.00000
title: Mulliken charges with hydrogens summed into heavy atoms:
elementType: Cl Cl O N N N N N C C C C C C C C C C C C C C C C C C C C C C C
charge: -0.025567 -0.024098 -0.270266 -0.117276 -0.193324 -0.114031 -0.093870 -0.108346 -0.038797 0.332207 0.059956 0.086498 -0.158421 0.137591 0.499431 -0.023217 -0.032458 -0.106875 -0.264404 0.267670 -0.299066 0.148640 0.273480 -0.049451 0.481194 -0.064300 -0.211240 0.022873 -0.030863 0.053335 -0.137007
polarizability: 3.87786102e+02 -1.13383545e+01 4.23465212e+02 4.29047220e+01 2.71274272e+01 2.11150072e+02
1716.lowfreq: -4.6761 -0.0021 -0.0018 -0.0015 4.1121 6.9180 14.0791 19.7953 21.0539
frequency: 13.9375 19.7945 20.9979 26.5474 36.1803 39.9662 46.9932 58.8355 64.5778 76.7206 90.3545 94.5318 97.5155 114.8050 132.3666 155.8422 158.6542 165.9828 174.5731 180.8675 203.1197 209.7298 214.7931 220.1406 231.4851 232.7639 239.5561 250.3352 262.1488 284.0568 304.4195 325.6836 332.8502 343.9278 377.0249 385.2756 407.4620 421.0673 428.4683 440.7489 445.6633 476.9305 488.6293 516.0299 524.8714 531.7452 554.9530 569.7650 579.2980 583.7116 588.9218 644.0192 654.3945 660.8302 686.9293 691.5009 705.6316 711.7571 734.7820 745.4845 760.6060 768.8015 770.3064 798.5320 799.6974 802.8375 829.8115 834.3659 857.0249 866.2728 889.0597 913.5707 917.5347 936.0630 952.8247 982.3038 987.7784 989.4048 992.8998 993.9363 997.0764 1006.4697 1047.2421 1072.5100 1079.2340 1086.9038 1090.5992 1105.4772 1113.5844 1120.3400 1120.5634 1138.9926 1145.5992 1164.0982 1167.9477 1189.3496 1206.5255 1211.2377 1234.3065 1243.4497 1254.4643 1259.8251 1270.3765 1286.9306 1287.1979 1298.6804 1314.2740 1332.0439 1356.0302 1364.5455 1375.1935 1379.2096 1386.9512 1388.3065 1392.9591 1396.0094 1403.5912 1433.8999 1435.8343 1454.3619 1454.5639 1461.0123 1462.9445 1465.7588 1466.4219 1469.1396 1470.3918 1471.8771 1473.9445 1475.5642 1482.6821 1484.3180 1490.6485 1493.6459 1525.4694 1555.3521 1565.1780 1582.4642 1597.7338 1607.9365 1621.7518 2831.4991 2854.1161 2927.6917 2957.6472 2981.9417 2983.4356 2989.9077 2992.4586 3033.9289 3036.3853 3044.6321 3076.0260 3077.7050 3079.0521 3087.1355 3091.7442 3104.0692 3122.5228 3124.4344 3145.7788 3155.1630 3156.2343 3165.3391 3171.7768 3192.1278 3526.5737 3548.3458
redmass: 4.8875 7.1784 5.1687 3.8822 3.8041 4.2723 4.6253 3.2069 3.5380 1.1054 2.1317 3.1489 2.9329 5.6853 3.9173 4.3427 3.2701 5.5637 4.2391 6.8747 3.9541 3.8101 2.9158 4.3953 1.4792 3.2057 1.3776 3.2789 2.8143 1.7856 3.2449 6.0208 5.6076 4.8841 3.6623 2.3897 4.7770 2.9772 5.7814 3.1462 3.2660 2.9904 8.1679 4.3697 1.5375 3.9882 3.8468 4.2313 3.9697 5.1504 3.4182 3.9345 3.2316 6.8517 3.1422 1.8341 5.2916 4.3603 4.1725 4.4219 4.6561 2.7968 3.6790 1.3182 1.2722 1.3614 1.6845 1.3119 1.6565 5.5374 1.9183 1.4369 6.1756 1.5688 3.4550 1.3998 6.4127 2.0769 5.1319 2.0400 2.4240 1.9933 1.5918 2.4365 2.4735 3.7375 1.9550 2.2664 1.2628 2.1984 1.8809 1.3101 1.4292 1.6103 1.5648 1.6001 2.1346 2.5224 1.5406 1.7064 2.9692 1.3641 2.0291 2.7950 1.2002 3.3246 1.3225 1.4434 3.7649 1.3510 2.8244 1.6026 1.3011 1.2395 4.4162 1.3705 3.3064 2.4285 1.2166 1.0684 1.3284 2.4033 1.4579 1.1938 1.0533 1.0878 1.0852 1.1823 1.2293 1.3522 1.4945 1.3260 1.0918 2.8269 4.1722 3.6372 6.3928 3.6779 4.9488 6.7629 6.5385 1.0717 1.0712 1.0642 1.0329 1.0359 1.0356 1.0941 1.0365 1.0864 1.0880 1.1038 1.0988 1.0982 1.0972 1.1005 1.1003 1.1005 1.0975 1.0913 1.0922 1.0928 1.0909 1.0932 1.0916 1.0950 1.0752 1.0758
irintensity: 0.1143 0.0904 0.0386 0.1123 0.0664 0.6493 0.3003 0.0689 0.8084 0.1701 0.1361 3.8037 0.6311 0.9214 5.5475 0.1939 0.5433 2.2625 0.3060 0.0825 0.9017 1.4400 1.1398 2.5450 0.5680 7.3311 0.0667 1.9001 2.8704 0.5225 1.0835 0.6837 3.8406 0.6142 5.3710 2.2090 3.2970 3.0949 7.1055 6.5829 5.7344 3.8888 26.9435 19.7361 79.1822 21.5852 3.9336 5.1505 8.8780 4.2124 7.8512 11.7660 8.1795 12.4995 1.3060 57.0210 9.0892 0.6577 5.3699 14.2907 0.6651 3.9840 5.1057 25.0967 36.2094 5.2885 53.5665 15.5497 67.7309 22.4354 3.7449 1.9995 17.2612 13.0786 0.4601 9.7678 33.7111 29.7783 10.2542 2.9587 18.2776 30.0410 11.7314 14.7139 24.2071 2.6250 21.0515 19.7315 0.1944 45.2795 39.7315 2.0611 7.9733 14.8439 7.3663 26.7033 193.8392 45.3035 20.2670 71.3851 31.1502 16.9863 10.2133 29.8273 16.1496 13.8160 4.9153 26.8837 42.1772 4.9795 37.6527 13.0865 29.8891 20.1523 98.8575 71.3164 24.7144 76.7053 19.8037 29.5700 192.1828 26.1587 337.5067 214.8975 10.4876 19.2847 31.3111 118.0234 74.6386 159.2465 22.6556 8.8107 15.3487 264.1443 172.4392 300.6274 549.3343 259.9402 89.1978 172.1610 26.6326 97.3394 154.0899 37.8565 92.5025 23.1063 27.1050 15.0492 23.0457 15.1830 12.4436 46.5967 19.7746 86.5285 13.0443 55.4333 31.1932 22.0841 34.4663 3.2814 3.5308 8.3345 4.3652 18.0965 6.9086 23.9344 41.5855 35.9218
temp: 298.150 k
press: 1.00000 atm
elementType: 17 17 8 7 7 7 7 7 6 6 6 6 6 6 6 6 6 6 6 6 6 6 6 6 6 6 6 6 6 6 6 1 1 1 1 1 1 1 1 1 1 1 1 1 1 1 1 1 1 1 1 1 1 1 1 1 1 1
symmnumber: 1
zpe: 1210460.8 jmol-1
zpe.correction: 0.461040 hartree
zpe.thermalcorrener: 0.492803 hartree
zpe.thermalcorrenthalpy: 0.493747 hartree
zpe.thermalcorrgfe: 0.394273 hartree
zpe.sumelectzpe: -2159.470350 hartree
zpe.sumelectthermal: -2159.438587 hartree
zpe.sumelectthermalent: -2159.437643 hartree
zpe.sumelectthermalfe: -2159.537117 hartree
dipole: -6.6249 2.2722 -0.5817
dipole: 7.0279
quadrupole: -189.1810 -179.6225 -193.2180
quadrupole: 8.5108 16.0668 1.2938
quadrupole: -1.8405 7.7180 -5.8775 8.5108 16.0668 1.2938
hfenergy: -2159.9313906 hartree
pointgroup: C01 [X(C23H27Cl2N5O1)]
dipole: 0.8757945 -2.569223 -0.526483 debye
polarizability: 348.0396492|22.7338798|413.9953582|-95.5165304|7.1014861|260.3663788 unknown
InChI: InChI=1S/C23H27Cl2N5O/c1-5-30(6-2)14-16-12-17(8-10-21(16)31-4)27-22-11-15(3)26-23(29-22)28-18-7-9-19(24)20(25)13-18/h7-13,27-28H,5-6,14H2,1-4H3
charge 0 multiplicity 1
58 atoms
Cl -2.889698 5.709506 0.865387
Cl -0.325359 5.563375 -1.214548
O  4.319426 -0.464177 -2.631918
N  2.832756 0.606382 1.187445
N  -0.290967 -3.095462 -0.652891
N  -1.525099 -1.246666 0.180607
N  -2.870094 0.537928 1.031338
N  -3.570912 -1.61204 1.479019
C  3.254161 0.484566 -0.229291
C  2.602262 -0.683306 -0.975226
C  3.81862 0.026704 2.136027
C  2.392093 1.973701 1.579009
C  1.445318 -1.309739 -0.479565
C  3.168567 -1.153368 -2.196648
C  0.840543 -2.389117 -1.173235
C  4.028946 -1.489633 1.96744
C  1.4457 1.979993 2.795326
C  2.5882 -2.242518 -2.886675
C  1.42201 -2.852914 -2.375946
C  -1.374517 -2.601153 0.057746
C  -2.318557 -3.51046 0.630769
C  4.958056 -0.925407 -3.865593
C  -3.405323 -2.967572 1.344804
C  -2.619593 -0.82553 0.875245
C  -2.227901 1.671287 0.493844
C  -4.449715 -3.835502 2.005705
C  -2.748919 2.943659 0.864552
C  -1.119085 1.610854 -0.395957
C  -2.177573 4.120823 0.352861
C  -0.565951 2.802509 -0.901939
C  -1.083301 4.062104 -0.534978
H  4.358929 0.394143 -0.325195
H  2.998174 1.419906 -0.767391
H  4.80932 0.546231 2.044392
H  3.452914 0.219136 3.160772
H  3.265202 2.646291 1.780106
H  1.845517 2.406499 0.722066
H  1.046802 -0.947898 0.470947
H  3.075937 -2.030685 2.098917
H  4.426288 -1.741591 0.968212
H  4.750795 -1.855027 2.721676
H  0.570342 1.337842 2.593196
H  1.938146 1.615681 3.714988
H  1.089519 3.008236 2.992324
H  3.02075 -2.614908 -3.81965
H  0.960538 -3.682361 -2.925467
H  -0.317679 -4.097311 -0.84923
H  -2.194785 -4.593017 0.536741
H  5.825579 -0.263772 -4.005891
H  5.299906 -1.975255 -3.775428
H  4.274528 -0.832156 -4.732107
H  -3.705494 0.697596 1.600814
H  -4.239902 -4.908594 1.864648
H  -4.494132 -3.618031 3.087852
H  -5.448846 -3.608891 1.592213
H  -3.600193 3.020386 1.549434
H  -0.712792 0.638006 -0.674497
H  0.277048 2.755415 -1.598453
