program: Gaussian 09
title: 000292542
version: EM64L-G09RevD.01
frameworkgroup: C1[X(C7H5BrN4)]
method: RPBEPBE
basis: SDD
operation: Freq
keyword: #p
keyword: freq=noraman
keyword: PBEPBE/SDD
title: #p freq=noraman PBEPBE/SDD
converged: YES YES NO NO
title: Mulliken charges:
elementType: Br N N N N C C C C C C C H H H H H
charge: 0.142003 -0.248733 -0.024871 -0.062431 -0.083228 0.486691 -0.349211 -0.351409 -0.200428 -0.202622 -0.233802 -0.126053 0.263852 0.270798 0.238993 0.240600 0.239852
chargesum: 0.00000
title: Mulliken charges with hydrogens summed into heavy atoms:
elementType: Br N N N N C C C C C C C
charge: 0.142003 -0.248733 -0.024871 -0.062431 -0.083228 0.486691 -0.085358 -0.080611 0.038564 0.037978 0.006050 -0.126053
polarizability: 1.48205900e+02 -1.08065533e+01 1.26291852e+02 -6.96872517e+00 -1.00990011e+01 6.00717195e+01
1716.lowfreq: -7.0156 -5.9350 -0.0008 -0.0008 -0.0002 6.7019 35.9650 80.1252 112.2076
frequency: 35.9429 80.1168 112.2058 190.7389 201.7719 294.2388 336.3812 376.2400 406.1676 445.9560 531.5169 609.8125 659.5491 664.0082 682.3430 694.3121 767.1441 843.0021 873.7631 911.9529 931.6227 976.7611 977.9611 988.8397 993.0895 1000.8306 1031.2111 1085.6454 1118.4848 1175.1801 1177.2844 1189.2773 1278.9691 1324.6703 1370.0191 1386.8389 1447.6577 1486.2067 1599.0525 1608.6482 3140.1159 3150.5506 3162.6669 3172.5448 3180.9625
redmass: 4.6533 7.5178 7.3308 7.4235 8.8068 9.5206 6.9345 11.0931 2.8468 6.4559 4.0404 6.6013 9.6168 11.2988 6.8843 2.1122 1.6755 1.2488 12.4033 3.2490 2.0296 10.0807 1.4181 6.8887 8.5631 1.3253 2.0080 1.6166 9.5710 3.6971 1.0678 1.2350 7.5406 1.3958 5.3221 10.1895 2.3003 2.5763 6.6516 6.1129 1.0857 1.0894 1.0935 1.0970 1.1009
irintensity: 0.4207 0.2790 0.8914 0.1810 0.6461 1.7267 0.1242 0.1940 0.0073 0.4530 14.3194 0.1420 5.7308 3.6046 7.1287 38.6387 67.1100 0.1373 7.0685 20.7205 14.4583 3.8926 0.4939 8.1142 18.3974 0.2007 4.0335 9.4596 5.2279 25.5692 0.3313 0.7349 89.8916 6.7994 30.5579 2.6245 5.7954 56.6108 4.0281 7.1301 0.0606 7.6825 18.1522 7.6587 5.4877
temp: 298.150 k
press: 1.00000 atm
elementType: 35 7 7 7 7 6 6 6 6 6 6 6 1 1 1 1 1
symmnumber: 1
zpe: 297106.1 jmol-1
zpe.correction: 0.113162 hartree
zpe.thermalcorrener: 0.122735 hartree
zpe.thermalcorrenthalpy: 0.123679 hartree
zpe.thermalcorrgfe: 0.075943 hartree
zpe.sumelectzpe: -501.296604 hartree
zpe.sumelectthermal: -501.287031 hartree
zpe.sumelectthermalent: -501.286087 hartree
zpe.sumelectthermalfe: -501.333823 hartree
dipole: 4.7791 -4.4080 -0.4709
dipole: 6.5186
quadrupole: -75.8060 -84.5936 -76.5324
quadrupole: 6.1404 -1.4403 -5.9218
quadrupole: 3.1713 -5.6163 2.4449 6.1404 -1.4403 -5.9218
hfenergy: -501.4097661 hartree
pointgroup: C01 [X(C7H5Br1N4)]
dipole: -2.3628936 0.9445749 -0.319024 debye
dipolederiv: 0.0356808 0.074202 -0.0336156 -0.0155828 -0.325716 0.1742663 0.0245798 0.1680026 0.0170442 -0.611081 0.1435215 -0.0474127 0.2216475 -0.2524051 0.0514801 -0.0533747 0.0906798 0.015837 0.1438412 -0.1561098 0.0608837 -0.5193675 -0.1082816 0.0153876 0.0446216 0.0191371 -0.0802879 -0.3998743 0.1326348 -0.0597146 0.0571328 -0.5019506 0.1567059 -0.1198079 0.1277753 -0.192374 -0.3655988 -0.0160087 0.0021707 0.0253848 0.0773282 -0.078878 0.1290954 -0.0864626 -0.1367808 0.7354475 0.0543042 -0.0254989 -0.059445 0.0548325 0.1012453 0.05144 0.0610576 0.0783489 -0.1010371 0.0601804 0.0385074 0.0125431 -0.0414087 0.0406372 0.0046864 0.0220917 -0.0891123 -0.1110684 -0.0896238 -0.011931 -0.022348 -0.0142658 0.0405156 -0.0020429 0.0206386 -0.1043871 -0.0489296 -0.1016421 -0.0317609 -0.1012122 0.0581402 0.0928631 -0.053077 0.078983 -0.1015809 -0.0170189 0.1076477 0.0531396 0.1038638 0.0477066 0.0846746 0.059879 0.0844453 -0.0984894 0.0995167 -0.0218865 0.0129179 -0.002534 -0.0632207 0.0305339 0.0113584 0.0353564 -0.1271048 0.5703324 -0.1920685 0.0830476 0.2954973 0.9011039 -0.4020743 -0.0646211 -0.3599819 0.1600964 0.0498626 -0.0617525 -0.0461443 -0.0674973 0.0316332 -0.0572034 -0.0481756 -0.0484547 0.1266955 0.0739966 0.068801 0.0210176 0.0577228 0.0518504 -0.0626368 0.0344582 -0.0385492 0.1374215 0.0336485 0.0571384 0.0265968 0.0809268 -0.0178805 -0.083464 0.0299289 -0.0766878 0.1214454 0.0198869 -0.0701167 -0.036183 -0.0810107 -0.0025938 -0.0768198 -0.0426592 -0.0754723 0.1214526 -0.1076051 0.0107784 -0.0060204 0.0142788 0.1051277 -0.0272334 -0.0062891 -0.0225589 0.1517756 unknown
polarizability: 152.68801|-0.8958854|124.01733|0.0396204|-2.6559906|57.8641309 unknown
InChI: InChI=1S/C7H5BrN4/c8-7-9-10-11-12(7)6-4-2-1-3-5-6/h1-5H
charge 0 multiplicity 1
17 atoms
Br 1.682045 2.402195 -0.925112
N  0.879203 -0.232043 0.095082
N  1.480226 -1.455472 0.500327
N  3.102183 0.045053 -0.047229
N  2.810022 -1.259786 0.407915
C  -0.553352 -0.112845 0.060164
C  -1.188633 1.039556 0.577063
C  -1.304245 -1.188532 -0.46803
C  -2.597155 1.12175 0.536857
C  -2.711308 -1.096591 -0.492412
C  -3.360728 0.058726 0.002246
C  1.900694 0.642207 -0.228536
H  -0.600446 1.84967 1.018112
H  -0.787526 -2.076758 -0.842801
H  -3.096162 2.011142 0.935265
H  -3.298553 -1.926003 -0.899543
H  -4.453264 0.126932 -0.022466
