program: Gaussian 09
title: 000292540
version: EM64L-G09RevD.01
frameworkgroup: C1[X(C10H12O2S)]
method: RPBEPBE
basis: SDD
operation: Freq
keyword: #p
keyword: freq=noraman
keyword: PBEPBE/SDD
title: #p freq=noraman PBEPBE/SDD
converged: YES YES NO NO
title: Mulliken charges:
elementType: S O O C C C C C C C C C C H H H H H H H H H H H H
charge: 0.175719 -0.403710 -0.243780 -0.522604 0.485390 -0.671175 -0.417585 -0.389506 -0.222033 -0.227045 -0.726949 -0.241094 0.280128 0.221728 0.230370 0.307372 0.270163 0.232705 0.236478 0.225075 0.225802 0.287950 0.279535 0.228435 0.378630
chargesum: 0.00000
title: Mulliken charges with hydrogens summed into heavy atoms:
elementType: S O O C C C C C C C C C C
charge: 0.175719 -0.025080 -0.243780 -0.070506 0.485390 -0.093640 -0.184880 -0.153028 0.003042 -0.001243 -0.159463 -0.012659 0.280128
polarizability: 1.77864620e+02 -6.69697050e+00 1.26780965e+02 -1.64108830e+01 -5.37847094e+00 8.36401631e+01
1716.lowfreq: -5.9800 -3.7044 -0.0030 -0.0013 -0.0009 3.6755 17.6528 28.3239 35.7255
frequency: 15.9517 28.2804 35.6744 47.5409 76.5803 108.0495 147.0690 190.5138 232.1777 292.9625 338.1513 394.9931 403.5512 497.7539 513.4194 550.9483 578.0485 617.2854 653.7652 681.3820 707.0038 733.5220 762.0064 782.9944 818.0264 837.2435 854.2254 901.3974 920.9997 973.3775 977.3117 990.0454 995.1698 1024.8392 1032.6418 1059.0568 1075.6545 1130.5258 1171.1361 1172.5125 1187.8366 1213.4164 1228.4687 1253.4420 1270.2503 1317.1063 1320.8299 1330.8359 1383.2506 1425.4821 1440.8590 1459.8405 1479.9838 1484.6025 1593.9461 1613.7502 1648.5406 2995.2314 3017.6931 3050.5683 3061.0556 3099.5821 3116.0911 3117.4461 3132.4656 3144.5524 3149.0814 3162.7258 3513.8182
redmass: 4.4800 5.9238 3.4810 7.9392 4.2871 2.8750 5.0901 7.6438 7.0079 3.8117 2.5512 2.3520 2.8111 3.2110 4.0296 5.6117 2.5303 6.3742 1.7811 4.8946 1.6448 6.2145 2.1811 1.1534 3.2920 4.7769 1.2472 2.0259 1.4684 1.4774 1.4007 6.1246 1.3222 2.5539 2.9600 1.9233 1.4796 1.1175 1.2081 1.0527 1.1176 2.5030 1.1924 1.2323 1.2129 1.9836 1.4695 1.2744 7.7785 1.1241 2.1672 1.0841 1.2999 1.7431 6.0479 6.1468 8.3625 1.0593 1.0565 1.1028 1.0583 1.1094 1.0866 1.0875 1.0910 1.0959 1.1077 1.1015 1.0640
irintensity: 0.0989 0.1732 0.1231 1.8683 1.5843 3.3712 1.1080 1.5822 0.9479 3.7390 1.2808 5.4772 0.0146 20.6855 37.3604 3.1442 49.7723 0.1631 127.7169 10.1662 71.7871 6.0803 35.0774 2.8772 3.4624 23.2807 0.0127 4.5616 2.2680 0.5634 0.1652 0.1761 0.2073 18.8647 14.4944 254.9807 8.0471 7.3805 43.1520 0.0459 0.2280 0.0467 6.8100 4.2325 1.9133 40.1269 37.2781 3.5258 0.0042 23.3980 7.4614 4.6031 15.7849 10.4352 1.4594 6.9558 193.9559 16.1410 20.0203 8.9097 10.3335 9.5854 7.9548 5.8942 10.8824 42.7483 0.5605 24.1050 30.0955
temp: 298.150 k
press: 1.00000 atm
elementType: 16 8 8 6 6 6 6 6 6 6 6 6 6 1 1 1 1 1 1 1 1 1 1 1 1
symmnumber: 1
zpe: 517603.5 jmol-1
zpe.correction: 0.197145 hartree
zpe.thermalcorrener: 0.210521 hartree
zpe.thermalcorrenthalpy: 0.211465 hartree
zpe.thermalcorrgfe: 0.153135 hartree
zpe.sumelectzpe: -935.807375 hartree
zpe.sumelectthermal: -935.793999 hartree
zpe.sumelectthermalent: -935.793055 hartree
zpe.sumelectthermalfe: -935.851384 hartree
dipole: 0.0438 0.0819 0.5065
dipole: 0.5150
quadrupole: -75.2913 -82.9172 -84.2567
quadrupole: 3.4575 -1.7329 -6.4701
quadrupole: 5.5304 -2.0954 -3.4350 3.4575 -1.7329 -6.4701
hfenergy: -936.0045194 hartree
pointgroup: C01 [X(C10H12O2S1)]
dipole: 0.0149034 0.1481832 -0.1373743 debye
dipolederiv: -0.2932057 0.0021798 -0.004095 0.0174849 -0.2114894 -0.1025337 0.0077029 -0.0949165 -0.015406 -1.1807614 0.3282449 -0.0471658 0.5478853 -0.491224 0.1089749 -0.0690317 0.1352744 -0.3399035 -0.6876107 0.1033853 -0.2039434 0.0445565 -0.4737354 -0.2895676 -0.1959581 -0.0986464 -0.7319408 -0.1565551 -0.0484224 -0.0120373 0.0102924 0.1184752 0.0119638 -0.1231722 0.0003024 0.151935 0.2780458 0.0077522 0.1228929 -0.0374917 -0.0365499 0.0176085 0.2501992 0.0313075 0.0021238 0.4728586 -0.0113896 0.1150188 0.0300796 0.1436007 0.0447601 0.0864278 0.0128895 -0.0420277 -0.1819341 -0.0190178 0.0168086 -0.0238674 -0.0281721 0.1241244 0.0038369 0.1075365 -0.0451341 -0.115775 -0.1043899 -0.0111313 -0.1180282 -0.0328372 0.0384905 -0.0441304 0.0585011 -0.1193426 0.0234177 -0.1042246 0.0093522 -0.1114279 0.005427 0.0667487 -0.0148373 0.0675716 -0.0791108 -0.0446943 -0.0135165 0.0443751 0.005065 0.0151384 0.127689 0.055305 0.127598 -0.0057241 -0.0397547 0.0812331 -0.0266802 0.0786023 -0.0113292 -0.1220683 0.0251539 -0.1563134 -0.1105498 0.0034403 -0.0247522 0.1041037 -0.0168809 -0.1172772 0.036367 0.0917706 0.0344886 -0.0817625 1.3812684 -0.4809252 0.3172494 -0.7564801 0.7350851 0.4811764 0.2683358 0.2702576 0.8163057 0.0515678 0.0159747 0.0066976 0.0002621 0.0275859 -0.1152033 0.0136525 -0.0558721 -0.0834041 0.034648 0.0501263 -0.050998 0.0432324 -0.0901747 0.0583847 -0.0190313 0.0168521 0.0524748 0.0273938 -0.0132127 -0.020304 0.0165255 0.0409071 -0.0590146 -0.0496236 -0.0386483 -0.026528 -0.052321 0.0468239 -0.0310334 0.0215028 -0.0852866 0.0666044 -0.0614413 0.0492609 0.0352479 0.1012467 -0.023966 -0.0634332 -0.0143068 0.0143088 -0.1155066 -0.045534 -0.1254781 0.0070223 -0.0024108 0.122986 0.007517 0.1222441 0.0257346 -0.0386489 0.0056478 -0.0345812 0.1042457 -0.0295304 0.1170379 0.005327 0.1356848 0.009622 -0.055565 0.0054107 -0.0604339 0.1098197 0.0789496 -0.007371 -0.0429272 -0.0193966 0.0025201 -0.1334587 -0.0652037 -0.1335255 0.0158589 -0.0427448 -0.067192 -0.0282431 -0.017134 0.0976171 -0.0244974 0.0227622 -0.0264027 0.0765937 0.0689633 0.063938 -0.0166516 0.0290649 0.0076131 0.0438851 0.0334745 0.0880416 -0.0110924 -0.0763823 0.014971 -0.1165543 0.016062 0.1137168 -0.0321384 -0.1226508 -0.0333669 0.0677154 0.3818805 -0.0362735 -0.0741444 -0.0035313 0.2207238 -0.1385752 -0.0590652 -0.1416967 0.2525833 unknown
polarizability: 178.1682797|-8.7788732|101.5999439|14.2889904|22.2044659|108.5175248 unknown
InChI: InChI=1S/C10H12O2S/c11-10(12)8-13-7-6-9-4-2-1-3-5-9/h1-5,11H,6-8H2
charge 0 multiplicity 1
25 atoms
S  2.179505 0.635851 1.376953
O  4.809944 -0.743334 -0.589841
O  2.844029 -0.526489 -1.812702
C  -0.534223 -0.105125 1.246259
C  -1.865818 -0.136156 0.504888
C  0.551757 0.584659 0.38963
C  -2.865117 0.837531 0.7594
C  -2.11645 -1.123817 -0.483053
C  -4.085372 0.826667 0.045348
C  -3.334305 -1.138736 -1.198534
C  3.368463 1.099285 -0.031633
C  -4.323599 -0.161968 -0.937055
C  3.60811 -0.102203 -0.913828
H  -0.645999 0.434831 2.205413
H  -0.198501 -1.131964 1.484245
H  0.744259 0.024009 -0.540281
H  0.265891 1.62141 0.142285
H  -2.688285 1.60393 1.524667
H  -1.354721 -1.886302 -0.689195
H  -4.848734 1.583953 0.257545
H  -3.513087 -1.910616 -1.955714
H  4.295139 1.436903 0.452392
H  2.912529 1.914382 -0.613678
H  -5.269625 -0.173394 -1.489906
H  4.907611 -1.560907 -1.150109
